{"text_format":"1","workbook":"xlsx","n_sheets":8,"sheets":["Serviceability","HEM","Tables","Serviceability Calc","Tax Calc","User Problems","Version Control","Day and Months Table"],"not_rendered":{"charts":0,"images":1,"macros":1,"external_links":1,"defined_names":7,"comments":0,"pivot_tables":0},"unopened":[],"bounds":{"document_bytes":16777216,"sheet_cells":100000,"rows_first":2000,"rows_last":500,"rows_between":2000,"halvings":0,"cell_chars":16384,"cell_head_chars":4096},"cells_cut":0,"cells_raw":0,"read":"whole","date_system":"1900"}

{"sheet":"Serviceability","index":0,"n_rows":84,"n_cols":13,"rows_kept":84,"cut":false,"hidden":false,"merged":[[17,6,17,8],[57,6,57,9],[73,8,74,10],[73,11,74,11],[78,3,79,11],[73,3,74,7],[40,7,40,12],[42,7,42,12],[30,3,30,11]]}
[]
[]
[null,null,"Serviceability Calculator (Residential)"]
[null,null,null,"RedZed Lending Solutions Pty Ltd (ACL 311128)"]
[]
[null,null,null,"Information can be entered in the clear boxes, the grey boxes contain RedZed calculations."]
[]
[null,null,null,"Application name - mandatory"]
[]
[null,null,null,"Income Table",null,null,"Gross Annual",null,null,null,null,"Net Monthly"]
[]
[null,null,null,"Personal Income",null,"Select Household"]
[null,null,null,"Applicant / Guarantor 1","PAYG or Alt Doc","Household 1",100000," ",null,null,null,{"$f":"'Tax Calc'!I5","v":6317.7804166666656}]
[null,null,null,"Applicant / Guarantor 2","PAYG or Alt Doc","Household 2",150000,null,null,null,null,{"$f":"'Tax Calc'!I6","v":8869.4483333333319}]
[null,null,null,"Applicant / Guarantor 3","PAYG or Alt Doc",null,null,null,null,null,null,{"$f":"'Tax Calc'!I7","v":0}]
[null,null,null,"Applicant / Guarantor 4","PAYG or Alt Doc",null,null,null,null,null,null,{"$f":"'Tax Calc'!I8","v":0}]
[]
[null,null,null,null,null,"Select Household","Enter Source of Income"]
[null,null,null,"Applicant / Guarantor 1","Other Regular Monthly Income (eg - welfare payments, investments)"]
[null,null,null,"Applicant / Guarantor 2","Other Regular Monthly Income (eg - welfare payments, investments)"]
[null,null,null,"Applicant / Guarantor 3","Other Regular Monthly Income (eg - welfare payments, investments)"]
[null,null,null,"Applicant / Guarantor 4","Other Regular Monthly Income (eg - welfare payments, investments)"]
[]
[null,null,null,"Rental Income","Existing",null,null,null,null,null,null,{"$f":"G24*0.8/12","v":0}]
[null,null,null,"Rental Income","New",null,null,null,null,null,null,{"$f":"G25*0.8/12","v":0}]
[]
[null,null,null,"Company Income (if applicable)"]
[null,null,null,"*Serviceability for Company Applicants will be based on the Company & Guarantors joint ability to service all debts"]
[]
[null,null,null,"Company Applicants NPBT - Alt Doc","Once all company expenses and liabilities paid",null,null,null,null,null,null,{"$f":"(G30-(G30*Table_Company_Tax_Rate))/12","v":0}]
[null,null,null,{"$f":"IF(G30 <> 0, \"Only NPBT from the borrowing Company entity can be entered in this field. Other related company NPBT needs to be allocated to the director(s)/guarantor(s)\", 0)","v":0}]
[null,null,null,"Total Monthly Net Income",null,null,null,null,null,null,null,{"$f":"SUM(L13,L14,L15,L16,L19,L20,L21,L22,L24,L25,L30)","v":15187.228749999998}]
[]
[]
[null,null,null,"Monthly Living Expenses"]
[]
[null,null,null,"Applicants(s) declared expenses - mandatory"]
[null,null,null,"Ongoing (combined) standard monthly living expenses declared by applicant(s)"]
[]
[null,null,null,"RedZed Living Allowance",null,"Select Household"]
[null,null,null,"Number of adults - household 1",null,"Household 1",1,{"$f":"Tables!E82","v":" "}]
[null,null,null,"Number of dependant children - household 1",null,"Household 1",2]
[null,null,null,"Number of adults - household 2",null,"Household 2",2,{"$f":"Tables!E83","v":" "}]
[null,null,null,"Number of dependant children - household 2",null,"Household 2",3]
[]
[null,null,null,"Total Monthly Living Expenses used in assessment",null,null,null,null,null,null,null,{"$f":"MAX(SUM(L41:L44),G38)","v":0}]
[]
[]
[null,null,null,"Available Income",null,null,null,null,null,null,null,{"$f":"Tables!B311","v":7949.5971350524169}]
[]
[null,null,null,"Commitments",null,null,null,null,null,null,null,"Monthly"]
[]
[null,null,null,"RedZed Loan Applied For"]
[null,null,null,null,null,null,"Loan Amount","Years","Interest Only Term","Interest Rate"]
[null,null,null,null,"Loan 1",null,null,null,null,null,null,{"$f":"Tables!B317","v":0}]
[null,null,null,null,"Loan 2",null,null,null,null,null,null,{"$f":"Tables!B318","v":0}]
[null,null,null,"Note: An interest rate buffer is automatically applied by the calculator. You do not need to apply a separate buffer."]
[null,null,null,null,null,null,"Financier"]
[null,null,null,"Existing Loans","Loan 1 - Existing Secured"]
[null,null,null,null,"Loan 2 - Existing Secured"]
[null,null,null,null,"Loan 3 - Existing Unsecured"]
[null,null,null,null,"Loan 4 - Existing Unsecured"]
[]
[null,null,null,null,null,null,"Total Credit Limits"]
[null,null,null,"Credit Cards",null,null,null,"(@3.82%)",null,null,null,{"$f":"G65*3.82%","v":0}]
[]
[null,null,null,"Maintenance / On Going Rent"]
[]
[null,null,null,"Other Fixed Monthly Repayments"]
[]
[null,null,null,"Total Monthly Commitments",null,null,null,null,null,null,null,{"$f":"SUM(L55:L69)","v":0}]
[]
[]
[null,null,null,"This Serviceability Calculator is intended as a guide only and no loan approval can be assumed on the basis of the results of this calculator. All applications remain subject to the normal credit and approval criteria of RedZed Lending Solutions Pty Ltd.",null,null,null,null,null,null,null,{"$f":"IFERROR('Serviceability Calc'!C19,0)","v":0}]
[]
[]
[null,null,null,null,null,null,null,null,"Must Be > 1.1"]
[]
[null,null,null,"I, the Introducer, confirm that reasonable enquiries about the applicant(s) current and ongoing financial situation have been undertaken and are reflected in the figures entered into this calculation. The applicants(s) have been given sufficient time to consider the declared monthly living expenses amount which has been derived following due consideration."]
[]
[]
[]
[]
[null,null,null,null,null,null,null,null,null,null,null,null,{"$f":"'Version Control'!I1","v":"V10.12 210115"}]

{"sheet":"HEM","index":1,"n_rows":46,"n_cols":15,"rows_kept":46,"cut":false,"hidden":true,"merged":[[18,3,18,4]]}
["Income Range ($)","Single Adult","Single Adult +1","Single Adult +2","Single Adult +3","Single Adult +4","Single Adult +5","Single Adult +6","Couple","Couple +1","Couple +2","Couple +3","Couple +4","Couple +5","Couple +6"]
["0 - 21,000",1107.1089616577799,1576.2951856585021,1968.675353284427,2414.2161177415114,2826.5614606981726,3474.8086811202438,4079.8141064667334,2157.512933328318,2518.9404889090761,2776.3132094271391,3115.1135874309216,3598.8070765602215,3880.9865621034114,4163.1660476466004]
["21,001 - 32,000",1173.1466833663865,1576.2951856585021,1968.675353284427,2414.2161177415114,2826.5614606981726,3474.8086811202438,4079.8141064667334,2157.512933328318,2518.9404889090761,2776.3132094271391,3115.1135874309216,3598.8070765602215,3880.9865621034114,4163.1660476466004]
["32,001 - 43,000",1234.653679621428,1637.7008581463799,2030.046035439919,2414.2161177415114,2826.5614606981726,3474.8086811202438,4079.8141064667334,2218.7853282473957,2518.9404889090761,2776.3132094271391,3115.1135874309216,3598.8070765602215,3880.9865621034114,4163.1660476466004]
["43,001 - 54,000",1324.7020868573284,1727.6007736693318,2119.8946214685698,2503.726897254357,2916.0397191906177,3474.8086811202438,4079.8141064667334,2308.4900187072458,2608.3523720191943,2865.9450422559476,3115.1135874309216,3598.8070765602215,3880.9865621034114,4163.1660476466004]
["54,001 - 65,000",1486.9200850882778,1889.5511889693298,2281.7529177846427,2664.9769972581134,3077.2309619138505,3474.8086811202438,4079.8141064667334,2470.0891343874628,2769.4239671359028,3027.4128671667563,3275.7144068619095,3598.8070765602215,3880.9865621034114,4163.1660476466004]
["65,001 - 86,000",1696.336138119859,2098.6219105354453,2490.7045061543695,2873.1432213416465,3285.321450351109,3682.5677784089212,4079.8141064667334,2678.7060796760984,2977.3599605752447,3235.8603749783665,3483.042516741179,3805.8303119942857,4087.6113700738329,4369.39242815338]
["86,001 - 108,000",2017.785825665781,2419.5415208018717,2811.4412082129129,3192.6743633563697,3604.7363576300295,4001.4739906210916,4398.2116236121528,2998.9291109890237,3296.5377845911876,3555.8233638981492,3801.2873758622022,4123.6071843416275,4404.7767026797783,4685.9462210179299]
["108,001 - 129,000",2235.1726697915142,2636.570012532638,3028.3459502295677,3408.763766714243,3820.7473568151499,4217.141028571059,4613.534700326968,3215.4864726783112,3512.388194314251,3772.2049207537079,4016.5070934424857,4338.5102316939065,4619.2661714478054,4900.0221112017043]
["129,001 - 151,000",2648.9819960747482,3049.6968354819278,3441.2374462307939,3820.1034527118386,4231.9371738937252,4627.6759683484688,5023.4147628032133,3627.7167088946444,3923.2729409896497,4184.1001005443495,4426.1904067346686,4747.5911451611319,5027.5597542277537,5307.5283632943756]
["151,001 - 172,000",2818.2689837174053,3218.7048294262872,3610.1490536200267,3988.3801081730767,4400.1528799112939,4795.6238539597662,5191.0948280082384,3796.3577167251206,4091.3634834397121,4352.6044663375033,4593.7900230769774,4914.944263798101,5194.5909005663461,5474.2375373345913]
["172,001 - 215,000",2985.0884881090151,3385.2489988103935,3776.598486395877,4154.2040884164662,4565.9161013720723,4961.1230046878372,5356.3299080036013,3962.5406569388474,4257.003981713724,4518.6521065134448,4758.9459431413588,5079.8572946673085,5359.1864540994229,5638.5156135315392]
["215,001 - 269,000",3466.9600081453718,3866.3259846476408,4257.4011797506882,4633.1994760366588,5044.7374102814019,5439.1817608154097,5833.6261113494174,4442.5732465445444,4735.469766401332,4998.2949800319484,5236.0133229036546,5556.2231292825791,5834.6355999670877,6113.0480706515973]
["269,000 - 323,000",3935.5616557259123,4334.1548162308391,4724.9637599560347,5099.0050048828125,5510.373205511185,5904.0760929575035,6297.7789804038221,4909.3871731029267,5200.7596273998388,5464.7297630176627,5699.9429670794789,6019.4703027648793,6296.991085180367,6574.5118675958547]
["323,001 plus",4177.3760005327695,4575.5705682056478,4966.2416198034407,5339.3756723257202,5750.6568021850326,6143.9770025980988,6537.297203011165,5150.2786182451455,5440.8647726812187,5705.4255575206398,5939.346604373678,6258.5216664006985,6535.5824284395867,6812.6431904784749]
[]
[]
[]
["Income Range lookup","Row Offset Value",null,"Dependents/Household Number",null,1,2,3,4,5,6,7]
[21001,1,null,0,null,0,7,13,13,13,13,13]
[32001,2,null,1,null,1,8,13,13,13,13,13]
[43001,3,null,2,null,2,9,13,13,13,13,13]
[54001,4,null,3,null,3,10,13,13,13,13,13]
[65001,5,null,4,null,4,11,13,13,13,13,13]
[86001,6,null,5,null,5,12,13,13,13,13,13]
[108001,7,null,6,null,6,13,13,13,13,13,13]
[129001,8,null,7,null,13,13,13,13,13,13,13]
[151001,9,null,8,null,13,13,13,13,13,13,13]
[172001,10,null,9,null,13,13,13,13,13,13,13]
[215001,11,null,10,null,13,13,13,13,13,13,13]
[269000,12,null,11,null,13,13,13,13,13,13,13]
[323001,13,null,12,null,13,13,13,13,13,13,13]
[]
[]
[]
[]
[]
[]
[null,null,null,"Household 1",null,null,null,"Household 2"]
[null,null,null,"Gross Income",null,{"$f":"IF(EXACT(Serviceability!F13,D39),Serviceability!G13,0)+IF(EXACT(Serviceability!F14, D39),Serviceability!G14,0)+IF(EXACT(Serviceability!F15, D39),Serviceability!G15,0)+IF(EXACT(Serviceability!F16, D39),Serviceability!G16,0)","v":100000},null,"Gross Income",null,{"$f":"IF(EXACT(Serviceability!F13, H39),Serviceability!G13,0)+IF(EXACT(Serviceability!F14,H39),Serviceability!G14,0)+IF(EXACT(Serviceability!F15,H39),Serviceability!G15,0)+IF(EXACT(Serviceability!F16,H39),Serviceability!G16,0)","v":150000}]
[null,null,null,"Single/Couple",null,{"$f":"+Serviceability!$G$41","v":1},null,"Single/Couple",null,{"$f":"Serviceability!G43","v":2}]
[null,null,null,"Dependents",null,{"$f":"+Serviceability!$G$42","v":2},null,"Dependents",null,{"$f":"Serviceability!G44","v":3}]
[null,null,null,"HEM Row Offset Value",null,{"$f":"IFERROR(VLOOKUP(F40,HEM!$A$20:$B$32,2,TRUE),0)","v":6},null,"HEM Row Offset Value",null,{"$f":"IFERROR(VLOOKUP(J40,HEM!$A$20:$B$32,2,TRUE),0)","v":8}]
[null,null,null,"HEM Column Offset Value",null,{"$f":"OFFSET($E$20,F42,F41)","v":2},null,"HEM Column Offset Value",null,{"$f":"OFFSET($E$20,J42,J41)","v":10}]
[null,null,null,"HEM Starting Value",null,{"$f":"OFFSET(B2,0,0)","v":1107.1089616577799},null,"HEM Starting Value",null,{"$f":"OFFSET(F2,0,0)","v":2826.5614606981726}]
[null,null,null,"HEM Min Living Expense",null,{"$f":"IF(F40=0, 0, OFFSET($B$2,F43,F44))","v":2811.4412082129129},null,"HEM Min Living Expense",null,{"$f":"IF(J40=0,0,OFFSET($B$2,J43,J44))","v":4426.1904067346686}]

{"sheet":"Tables","index":2,"n_rows":318,"n_cols":15,"rows_kept":318,"cut":false,"hidden":true,"merged":[[68,5,68,6],[68,1,68,2],[68,7,68,8]]}
[]
["Tax"]
[null,null,null,null,null,null,"Flood Levy"]
["Wages Over","Not to Exceed","Tax Rate",null,null,null,"Taxable income","Flood levy on this income"]
[0,18200,0,null,null,null,"$0 to $50,000","Nil",0,50000,0]
[{"$f":"B5+1","v":18201},45000,0.19,{"$f":"D5+C5*(B5-A5)","v":0},null,null,"$50,001 to $100,000","Half a cent for each $1 over $50,000",50001,100000,0,{"$f":"(J6-J5)*K6","v":0}]
[{"$f":"B6+1","v":45001},120000,0.32500000000000001,{"$f":"ROUNDUP(D6+C6*(B6-A6),0)","v":5092},null,null,"Over $100,000","$250 plus 1c for each $1 over $100,000",{"$f":"J6+1","v":100001},null,0]
[{"$f":"B7+1","v":120001},180000,0.37,{"$f":"ROUNDUP(D7+C7*(B7-A7),0)","v":29467}]
[{"$f":"B8+1","v":180001},null,0.45,{"$f":"ROUNDUP(D8+C8*(B8-A8),0)","v":51667}]
[null,null,null,null,null,null,"                        "]
[null,null,null,null,null,null,"   "]
["Medicare Levy"]
[null,null,null,null,null,null,"Taxable income","Tax on this income"]
[0,16284,0,null,"not currently used",null,"0 - $18,200","Nil"]
[16284,17604,0.2,null,null,null,"$18,201 - $37,000","19c for each $1 over $18,200"]
["17604+",null,0.02,null,null,null,"$37,001 - $90,000","$3,572 plus 32.5c for each $1 over $37,000"]
[null,null,null,null,null,null,"$90,001 - $180,000","$17,547 plus 37c for each $1 over $87,000"]
[null,null,null,null,null,null,"$180,001 and over","$54,547 plus 45c for each $1 over $180,000"]
[]
["Company Tax"]
[]
["Rate",0.27500000000000002]
[]
[]
[]
[]
[]
["APR Buffer",0.02]
["Minimum Rate",0.06]
[]
["RedZed Loan Applied For: Repayment With Buffer",null,"Buffered %","Minimum %","Rate %","Buffer %","Buffered %","Total Term","Interest Only Term","Net Term","Amount"]
["Buffered Loan 1",{"$f":"IF(Serviceability!H55=0,0,-PMT((D32)/12,J32*12,Serviceability!G55))","v":0},{"$f":"G32","v":0.02},{"$f":"IF(C32>=$B$29,C32,$B$29)","v":0.06},{"$f":"Serviceability!J55","v":0},{"$f":"$B$28","v":0.02},{"$f":"E32+F32","v":0.02},{"$f":"Serviceability!H55","v":0},{"$f":"Serviceability!I55","v":0},{"$f":"H32-I32","v":0},{"$f":"Serviceability!G55","v":0}]
["Buffered Loan 2",{"$f":"IF(Serviceability!H56=0,0,-PMT((D33)/12,J33*12,Serviceability!G56))","v":0},{"$f":"G33","v":0.02},{"$f":"IF(C33>=$B$29,C33,$B$29)","v":0.06},{"$f":"Serviceability!J56","v":0},{"$f":"$B$28","v":0.02},{"$f":"E33+F33","v":0.02},{"$f":"Serviceability!H56","v":0},{"$f":"Serviceability!I56","v":0},{"$f":"H33-I33","v":0},{"$f":"Serviceability!G56","v":0}]
[]
[]
["Existing Loan: Repayment With Buffer"]
["Buffered Loan 1",0.2,{"$f":"Serviceability!L59*(1+Tables!B37)","v":0},null,null,null,{"$f":"Serviceability!L59","v":0},{"$f":"Serviceability!E59","v":"Loan 1 - Existing Secured"}]
["Buffered Loan 2",0.2,{"$f":"Serviceability!L60*(1+Tables!B38)","v":0},null,null,null,{"$f":"Serviceability!L60","v":0},{"$f":"Serviceability!E60","v":"Loan 2 - Existing Secured"}]
[]
[]
["Additional Fees for Serviceability",null,null,null,null,null," "]
["Fees - Loan 1",15,{"$f":"IF(Serviceability!L55=0,0,15)","v":0},"Monthly Account Keeping Fee Resi",null,null," "]
["Fees - Loan 2",15,{"$f":"IF(Serviceability!L56=0,0,15)","v":0},"Monthly Account Keeping Fee Resi",null,null," "]
[]
[]
[]
["Column1","Single Adult","Single Adult + 1 Dependant","Single Adult + 2 Dependants","Single Adult + 3 Dependants","Single Adult + 4 Dependants","Single Adult + 5 Dependants","Single Adult + 6 Dependants","Couple","Couple + 1 Dependant","Couple + 2 Dependants","Couple + 3 Dependants","Couple + 4 Dependants","Couple + 5 Dependants","Couple + 6 Dependants"]
["Income Range ($)","Proposed Benchmark","Proposed Benchmark","Proposed Benchmark","Proposed Benchmark","Proposed Benchmark","Proposed Benchmark","Proposed Benchmark","Proposed Benchmark","Proposed Benchmark","Proposed Benchmark","Proposed Benchmark","Proposed Benchmark","Proposed Benchmark","Proposed Benchmark"]
["0 - 21,000",{"$f":"251*52.2/12","v":1091.8500000000001},null,null,null,null,null,null,"-","-","-","-","-","-","-"]
["21,001 - 32,000",{"$f":"265*52.2/12","v":1152.75},{"$f":"354*52.2/12","v":1539.8999999999999},{"$f":"445*52.2/12","v":1935.75},"-","-","-","-",{"$f":"487*52.2/12","v":2118.4500000000003},"-","-","-","-","-","-"]
["32,001 - 43,000",{"$f":"280*52.2/12","v":1218},{"$f":"369*52.2/12","v":1605.1499999999999},{"$f":"460*52.2/12","v":2001},{"$f":"552*52.2/12","v":2401.2000000000003},{"$f":"(552+93)*52.2/12","v":2805.75},"-","-",{"$f":"502*52.2/12","v":2183.7000000000003},{"$f":"578*52.2/12","v":2514.3000000000002},{"$f":"636*52.2/12","v":2766.6000000000004},"-","-","-","-"]
["43,001 - 53,000",{"$f":"301*52.2/12","v":1309.3500000000001},{"$f":"391*52.2/12","v":1700.8500000000001},{"$f":"481*52.2/12","v":2092.35},{"$f":"574*52.2/12","v":2496.9},{"$f":"(574+93)*52.2/12","v":2901.4500000000003},"-","-",{"$f":"523*52.2/12","v":2275.0500000000002},{"$f":"599*52.2/12","v":2605.65},{"$f":"657*52.2/12","v":2857.9500000000003},{"$f":"720*52.2/12","v":3132},"-","-","-"]
["53,001 - 64,000",{"$f":"338*52.2/12","v":1470.3000000000002},{"$f":"428*52.2/12","v":1861.8000000000002},{"$f":"519*52.2/12","v":2257.65},{"$f":"612*52.2/12","v":2662.2000000000003},{"$f":"(612+93)*52.2/12","v":3066.75},{"$f":"(612+93+93)*52.2/12","v":3471.3000000000006},"-",{"$f":"561*52.2/12","v":2440.35},{"$f":"637*52.2/12","v":2770.9500000000003},{"$f":"694*52.2/12","v":3018.9},{"$f":"757*52.2/12","v":3292.9500000000003},{"$f":"(757+63)*52.2/12","v":3567},{"$f":"(757+63+63)*52.2/12","v":3841.0500000000006},"-"]
["64,001 - 85,000",{"$f":"385*52.2/12","v":1674.75},{"$f":"475*52.2/12","v":2066.25},{"$f":"566*52.2/12","v":2462.1},{"$f":"659*52.2/12","v":2866.65},{"$f":"(659+93)*52.2/12","v":3271.2000000000003},{"$f":"(659+93+93)*52.2/12","v":3675.75},{"$f":"(659+93+93)*52.2/12","v":3675.75},{"$f":"608*52.2/12","v":2644.8},{"$f":"684*52.2/12","v":2975.4},{"$f":"741*52.2/12","v":3223.3500000000004},{"$f":"804*52.2/12","v":3497.4},{"$f":"(804+63)*52.2/12","v":3771.4500000000003},{"$f":"(804+63+63)*52.2/12","v":4045.5},{"$f":"(804+63+63)*52.2/12","v":4045.5}]
["85,001 - 107,000",{"$f":"459*52.2/12","v":1996.6500000000003},{"$f":"549*52.2/12","v":2388.15},{"$f":"640*52.2/12","v":2784},{"$f":"733*52.2/12","v":3188.5499999999997},{"$f":"(733+93)*52.2/12","v":3593.1000000000004},{"$f":"(733+93+93)*52.2/12","v":3997.65},{"$f":"(733+93+93+93)*52.2/12","v":4402.2},{"$f":"682*52.2/12","v":2966.7000000000003},{"$f":"757*52.2/12","v":3292.9500000000003},{"$f":"815*52.2/12","v":3545.25},{"$f":"878*52.2/12","v":3819.3000000000006},{"$f":"(878+63)*52.2/12","v":4093.3500000000004},{"$f":"(878+63+63)*52.2/12","v":4367.4000000000005},{"$f":"(878+63+63)*52.2/12","v":4367.4000000000005}]
["107,001 - 128,000",{"$f":"513*52.2/12","v":2231.5500000000002},{"$f":"603*52.2/12","v":2623.05},{"$f":"693*52.2/12","v":3014.5499999999997},{"$f":"(787)*52.2/12","v":3423.4500000000003},{"$f":"(787+94)*52.2/12","v":3832.3500000000004},{"$f":"(787+94+94)*52.2/12","v":4241.25},{"$f":"(787+94+94+94)*52.2/12","v":4650.1500000000005},{"$f":"735*52.2/12","v":3197.25},{"$f":"811*52.2/12","v":3527.8500000000004},{"$f":"868*52.2/12","v":3775.8000000000006},{"$f":"931*52.2/12","v":4049.8500000000004},{"$f":"(931+63)*52.2/12","v":4323.9000000000005},{"$f":"(931+63+63)*52.2/12","v":4597.95},{"$f":"(931+63+63)*52.2/12","v":4597.95}]
["128,001 - 150,000",{"$f":"603*52.2/12","v":2623.05},{"$f":"693*52.2/12","v":3014.5499999999997},{"$f":"784*52.2/12","v":3410.4},{"$f":"(878)*52.2/12","v":3819.3000000000006},{"$f":"(878+94)*52.2/12","v":4228.2},{"$f":"(878+94+94)*52.2/12","v":4637.1000000000004},{"$f":"(878+94+94+94)*52.2/12","v":5046},{"$f":"826*52.2/12","v":3593.1000000000004},{"$f":"901*52.2/12","v":3919.3500000000004},{"$f":"959*52.2/12","v":4171.6500000000005},{"$f":"1022*52.2/12","v":4445.7},{"$f":"(1022+63)*52.2/12","v":4719.75},{"$f":"(1022+63+63)*52.2/12","v":4993.8},{"$f":"(1022+63+63)*52.2/12","v":4993.8}]
["150,001 - 171,000",{"$f":"637*52.2/12","v":2770.9500000000003},{"$f":"727*52.2/12","v":3162.4500000000003},{"$f":"818*52.2/12","v":3558.3000000000006},{"$f":"(912)*52.2/12","v":3967.2000000000003},{"$f":"(912+94)*52.2/12","v":4376.1000000000004},{"$f":"(912+94+94)*52.2/12","v":4785},{"$f":"(912+94+94+94)*52.2/12","v":5193.9000000000005},{"$f":"860*52.2/12","v":3741},{"$f":"935*52.2/12","v":4067.25},{"$f":"993*52.2/12","v":4319.55},{"$f":"1056*52.2/12","v":4593.6000000000004},{"$f":"(1056+63)*52.2/12","v":4867.6500000000005},{"$f":"(1056+63+63)*52.2/12","v":5141.7},{"$f":"(1056+63+63)*52.2/12","v":5141.7}]
["171,001 - 214,000",{"$f":"676*52.2/12","v":2940.6000000000004},{"$f":"766*52.2/12","v":3332.1000000000004},{"$f":"857*52.2/12","v":3727.9500000000003},{"$f":"(951)*52.2/12","v":4136.8500000000004},{"$f":"(951+94)*52.2/12","v":4545.75},{"$f":"(951+94+94)*52.2/12","v":4954.6500000000005},{"$f":"(951+94+94+94)*52.2/12","v":5363.55},{"$f":"899*52.2/12","v":3910.65},{"$f":"974*52.2/12","v":4236.9000000000005},{"$f":"1032*52.2/12","v":4489.2},{"$f":"1095*52.2/12","v":4763.25},{"$f":"(1095+63)*52.2/12","v":5037.3},{"$f":"(1095+63+63)*52.2/12","v":5311.35},{"$f":"(1095+63+63)*52.2/12","v":5311.35}]
["214,001 - 267,000",{"$f":"781*52.2/12","v":3397.3500000000004},{"$f":"871*52.2/12","v":3788.8500000000004},{"$f":"962*52.2/12","v":4184.7},{"$f":"(1056)*52.2/12","v":4593.6000000000004},{"$f":"(1056+95)*52.2/12","v":5006.8500000000004},{"$f":"(1056+95+95)*52.2/12","v":5420.1},{"$f":"(1056+95+95+95)*52.2/12","v":5833.3499999999995},{"$f":"1004*52.2/12","v":4367.4000000000005},{"$f":"1079*52.2/12","v":4693.6500000000005},{"$f":"1136*52.2/12","v":4941.6000000000004},{"$f":"1199*52.2/12","v":5215.6500000000005},{"$f":"(1199+63)*52.2/12","v":5489.7000000000007},{"$f":"(1199+63+63)*52.2/12","v":5763.75},{"$f":"(1199+63+63)*52.2/12","v":5763.75}]
["267,000 - 321,000",{"$f":"912*52.2/12","v":3967.2000000000003},{"$f":"1003*52.2/12","v":4363.05},{"$f":"1093*52.2/12","v":4754.55},{"$f":"(1188)*52.2/12","v":5167.8},{"$f":"(1188+95)*52.2/12","v":5581.05},{"$f":"(1188+95+95)*52.2/12","v":5994.3},{"$f":"(1188+95+95+95)*52.2/12","v":6407.55},{"$f":"1135*52.2/12","v":4937.25},{"$f":"1210*52.2/12","v":5263.5},{"$f":"1268*52.2/12","v":5515.8},{"$f":"1330*52.2/12","v":5785.5},{"$f":"(1330+63)*52.2/12","v":6059.55},{"$f":"(1330+63+63)*52.2/12","v":6333.5999999999995},{"$f":"(1330+63+63)*52.2/12","v":6333.5999999999995}]
["321,001 plus",{"$f":"944*52.2/12","v":4106.4000000000005},{"$f":"1034*52.2/12","v":4497.9000000000005},{"$f":"1125*52.2/12","v":4893.75},{"$f":"(1220)*52.2/12","v":5307},{"$f":"(1220+95)*52.2/12","v":5720.25},{"$f":"(1220+95+95)*52.2/12","v":6133.5},{"$f":"(1220+95+95+95)*52.2/12","v":6546.75},{"$f":"1167*52.2/12","v":5076.45},{"$f":"1241*52.2/12","v":5398.35},{"$f":"1299*52.2/12","v":5650.6500000000005},{"$f":"1362*52.2/12","v":5924.7000000000007},{"$f":"(1362+63)*52.2/12","v":6198.75},{"$f":"(1362+63+63)*52.2/12","v":6472.8},{"$f":"(1362+63+63)*52.2/12","v":6472.8}]
[" "]
[]
[]
[]
[]
["Household 1"]
["Household 2","Monthly Income",null,null,null,"Other Income",null,"Company"]
[]
[null,"Household 1","Household 2",null,null,"Household 1","Household 2",null,"Always Household 1"]
["Applicant / Guarantor 1",{"$f":"IF(EXACT(Serviceability!F13, \"Household 1\"),Serviceability!G13,0)","v":100000},{"$f":"IF(EXACT(Serviceability!F13, \"Household 2\"),Serviceability!G13,0)","v":0},null,"Applicant / Guarantor 1",{"$f":"IF(EXACT(Serviceability!F19, \"Household 1\"),Serviceability!L19,0)","v":0},{"$f":"IF(EXACT(Serviceability!F19, \"Household 2\"),Serviceability!L19,0)","v":0},"Applicant / Guarantor 1",{"$f":"Serviceability!G30","v":0}]
["Applicant / Guarantor 2",{"$f":"IF(EXACT(Serviceability!F14, \"Household 1\"),Serviceability!G14,0)","v":0},{"$f":"IF(EXACT(Serviceability!F14, \"Household 2\"),Serviceability!G14,0)","v":150000},null,"Applicant / Guarantor 2",{"$f":"IF(EXACT(Serviceability!F20, \"Household 1\"),Serviceability!L20,0)","v":0},{"$f":"IF(EXACT(Serviceability!F20, \"Household 2\"),Serviceability!L20,0)","v":0}]
["Applicant / Guarantor 3",{"$f":"IF(EXACT(Serviceability!F15, \"Household 1\"),Serviceability!G15,0)","v":0},{"$f":"IF(EXACT(Serviceability!F15, \"Household 2\"),Serviceability!G15,0)","v":0},null,"Applicant / Guarantor 3",{"$f":"IF(EXACT(Serviceability!F21, \"Household 1\"),Serviceability!L21,0)","v":0},{"$f":"IF(EXACT(Serviceability!F21, \"Household 2\"),Serviceability!L21,0)","v":0}]
["Applicant / Guarantor 4",{"$f":"IF(EXACT(Serviceability!F16, \"Household 1\"),Serviceability!G16,0)","v":0},{"$f":"IF(EXACT(Serviceability!F16, \"Household 2\"),Serviceability!G16,0)","v":0},null,"Applicant / Guarantor 4",{"$f":"IF(EXACT(Serviceability!F22, \"Household 1\"),Serviceability!L22,0)","v":0},{"$f":"IF(EXACT(Serviceability!F22, \"Household 2\"),Serviceability!L22,0)","v":0}]
["Applicant Totals",{"$f":"SUM(B72:B75,F76,I72)","v":100000},{"$f":"SUM(C72:C75,G76)","v":150000},null,"Applicant Totals",{"$f":"SUM(F72:F75)*12","v":0},{"$f":"SUM(G72:G75)*12","v":0}]
[]
["Adults - household","",{"$f":"IF(C76<=59999,\"test\",IF(B3>93,\"A\",IF(B3>89,\"A-\",IF(B3>87,\"B+\",IF(B3>83,\"B\",IF(B3>79,\"B-\", IF(B3>77,\"C+\",IF(B3>73,\"C\",IF(B3>69,\"C-\",IF(B3>57,\"D+\",IF(B3>53,\"D\",IF(B3>49,\"D-\",\"\"))))))))))))","v":""}]
["Adults - household - new",{"$error":"#REF!"}]
["Dependant children - household"]
[]
["Adult",{"$f":"Serviceability!G41","v":1},{"$f":"Serviceability!G43","v":2},null,{"$f":"IF(Serviceability!G41>2, \"Please call 1300 722 462 for assistance with calculation \",\" \")","v":" "},null,null,null,null,null,null,null,null,"offset amount"]
["Dependent ",{"$f":"Serviceability!G42","v":2},{"$f":"Serviceability!G44","v":3},null,{"$f":"IF(Serviceability!G43>2, \"Please call 1300 722 462 for assistance with calculation \",\" \")","v":" "}]
[null,{"$f":"\"Adult-\" & B82 & \",Dependents-\" & B83","v":"Adult-1,Dependents-2"},{"$f":"\"Adult-\" & C82 & \",Dependents-\" & C83","v":"Adult-2,Dependents-3"}]
[]
["LookupKey","Household","Income Range","Living Expense"]
[{"$f":"B87 & \":\" & C87","v":"Adult-1,Dependents-0:0-21000"},"Adult-1,Dependents-0","0-21000",{"$f":"251*52.2/12","v":1091.8500000000001}]
[{"$f":"B88 & \":\" & C88","v":"Adult-1,Dependents-0:21000-32000"},"Adult-1,Dependents-0","21000-32000",{"$f":"265*52.2/12","v":1152.75}]
["Adult-1,Dependents-0:32001-43000","Adult-1,Dependents-0","32001-43000",{"$f":"280*52.2/12","v":1218}]
["Adult-1,Dependents-0:43001-53000","Adult-1,Dependents-0","43001-53000",{"$f":"301*52.2/12","v":1309.3500000000001}]
["Adult-1,Dependents-0:53001-64000","Adult-1,Dependents-0","53001-64000",{"$f":"338*52.2/12","v":1470.3000000000002}]
["Adult-1,Dependents-0:64001-85000","Adult-1,Dependents-0","64001-85000",{"$f":"385*52.2/12","v":1674.75}]
["Adult-1,Dependents-0:85001-107000","Adult-1,Dependents-0","85001-107000",{"$f":"459*52.2/12","v":1996.6500000000003}]
["Adult-1,Dependents-0:107001-128000","Adult-1,Dependents-0","107001-128000",{"$f":"513*52.2/12","v":2231.5500000000002}]
["Adult-1,Dependents-0:128001-150000","Adult-1,Dependents-0","128001-150000",{"$f":"603*52.2/12","v":2623.05}]
["Adult-1,Dependents-0:150001-171000","Adult-1,Dependents-0","150001-171000",{"$f":"637*52.2/12","v":2770.9500000000003}]
["Adult-1,Dependents-0:171001-214000","Adult-1,Dependents-0","171001-214000",{"$f":"676*52.2/12","v":2940.6000000000004}]
["Adult-1,Dependents-0:214001-267000","Adult-1,Dependents-0","214001-267000",{"$f":"781*52.2/12","v":3397.3500000000004}]
["Adult-1,Dependents-0:267001-321000","Adult-1,Dependents-0","267001-321000",{"$f":"912*52.2/12","v":3967.2000000000003}]
["Adult-1,Dependents-0:321000+","Adult-1,Dependents-0","321000+",{"$f":"944*52.2/12","v":4106.4000000000005}]
[]
["Adult-1,Dependents-1:0-21000","Adult-1,Dependents-1","0-21000",{"$f":"354*52.2/12","v":1539.8999999999999}]
["Adult-1,Dependents-1:21000-32000","Adult-1,Dependents-1","21000-32000",{"$f":"354*52.2/12","v":1539.8999999999999}]
["Adult-1,Dependents-1:32001-43000","Adult-1,Dependents-1","32001-43000",{"$f":"369*52.2/12","v":1605.1499999999999}]
["Adult-1,Dependents-1:43001-53000","Adult-1,Dependents-1","43001-53000",{"$f":"391*52.2/12","v":1700.8500000000001}]
["Adult-1,Dependents-1:53001-64000","Adult-1,Dependents-1","53001-64000",{"$f":"428*52.2/12","v":1861.8000000000002}]
["Adult-1,Dependents-1:64001-85000","Adult-1,Dependents-1","64001-85000",{"$f":"475*52.2/12","v":2066.25}]
["Adult-1,Dependents-1:85001-107000","Adult-1,Dependents-1","85001-107000",{"$f":"549*52.2/12","v":2388.15}]
["Adult-1,Dependents-1:107001-128000","Adult-1,Dependents-1","107001-128000",{"$f":"603*52.2/12","v":2623.05}]
["Adult-1,Dependents-1:128001-150000","Adult-1,Dependents-1","128001-150000",{"$f":"693*52.2/12","v":3014.5499999999997}]
["Adult-1,Dependents-1:150001-171000","Adult-1,Dependents-1","150001-171000",{"$f":"727*52.2/12","v":3162.4500000000003}]
["Adult-1,Dependents-1:171001-214000","Adult-1,Dependents-1","171001-214000",{"$f":"766*52.2/12","v":3332.1000000000004}]
["Adult-1,Dependents-1:214001-267000","Adult-1,Dependents-1","214001-267000",{"$f":"871*52.2/12","v":3788.8500000000004}]
["Adult-1,Dependents-1:267001-321000","Adult-1,Dependents-1","267001-321000",{"$f":"1003*52.2/12","v":4363.05}]
["Adult-1,Dependents-1:321000+","Adult-1,Dependents-1","321000+",{"$f":"1034*52.2/12","v":4497.9000000000005}]
[]
[{"$f":"B117 & \":\" & C117","v":"Adult-1,Dependents-2:0-21000"},"Adult-1,Dependents-2","0-21000",{"$f":"445*52.2/12","v":1935.75}]
["Adult-1,Dependents-2:21000-32000","Adult-1,Dependents-2","21000-32000",{"$f":"445*52.2/12","v":1935.75}]
["Adult-1,Dependents-2:32001-43000","Adult-1,Dependents-2","32001-43000",{"$f":"460*52.2/12","v":2001}]
["Adult-1,Dependents-2:43001-53000","Adult-1,Dependents-2","43001-53000",{"$f":"481*52.2/12","v":2092.35}]
["Adult-1,Dependents-2:53001-64000","Adult-1,Dependents-2","53001-64000",{"$f":"519*52.2/12","v":2257.65}]
["Adult-1,Dependents-2:64001-85000","Adult-1,Dependents-2","64001-85000",{"$f":"566*52.2/12","v":2462.1}]
["Adult-1,Dependents-2:85001-107000","Adult-1,Dependents-2","85001-107000",{"$f":"640*52.2/12","v":2784}]
["Adult-1,Dependents-2:107001-128000","Adult-1,Dependents-2","107001-128000",{"$f":"693*52.2/12","v":3014.5499999999997}]
["Adult-1,Dependents-2:128001-150000","Adult-1,Dependents-2","128001-150000",{"$f":"784*52.2/12","v":3410.4}]
["Adult-1,Dependents-2:150001-171000","Adult-1,Dependents-2","150001-171000",{"$f":"818*52.2/12","v":3558.3000000000006}]
["Adult-1,Dependents-2:171001-214000","Adult-1,Dependents-2","171001-214000",{"$f":"857*52.2/12","v":3727.9500000000003}]
["Adult-1,Dependents-2:214001-267000","Adult-1,Dependents-2","214001-267000",{"$f":"962*52.2/12","v":4184.7}]
["Adult-1,Dependents-2:267001-321000","Adult-1,Dependents-2","267001-321000",{"$f":"1093*52.2/12","v":4754.55}]
["Adult-1,Dependents-2:321000+","Adult-1,Dependents-2","321000+",{"$f":"1125*52.2/12","v":4893.75}]
[]
[{"$f":"B132 & \":\" & C132","v":"Adult-1,Dependents-3:0-21000"},"Adult-1,Dependents-3","0-21000",{"$f":"552*52.2/12","v":2401.2000000000003}]
["Adult-1,Dependents-3:21000-32000","Adult-1,Dependents-3","21000-32000",{"$f":"552*52.2/12","v":2401.2000000000003}]
["Adult-1,Dependents-3:32001-43000","Adult-1,Dependents-3","32001-43000",{"$f":"552*52.2/12","v":2401.2000000000003}]
["Adult-1,Dependents-3:43001-53000","Adult-1,Dependents-3","43001-53000",{"$f":"574*52.2/12","v":2496.9}]
["Adult-1,Dependents-3:53001-64000","Adult-1,Dependents-3","53001-64000",{"$f":"612*52.2/12","v":2662.2000000000003}]
["Adult-1,Dependents-3:64001-85000","Adult-1,Dependents-3","64001-85000",{"$f":"659*52.2/12","v":2866.65}]
["Adult-1,Dependents-3:85001-107000","Adult-1,Dependents-3","85001-107000",{"$f":"733*52.2/12","v":3188.5499999999997}]
["Adult-1,Dependents-3:107001-128000","Adult-1,Dependents-3","107001-128000",{"$f":"(787)*52.2/12","v":3423.4500000000003}]
["Adult-1,Dependents-3:128001-150000","Adult-1,Dependents-3","128001-150000",{"$f":"(878)*52.2/12","v":3819.3000000000006}]
["Adult-1,Dependents-3:150001-171000","Adult-1,Dependents-3","150001-171000",{"$f":"(912)*52.2/12","v":3967.2000000000003}]
["Adult-1,Dependents-3:171001-214000","Adult-1,Dependents-3","171001-214000",{"$f":"(951)*52.2/12","v":4136.8500000000004}]
["Adult-1,Dependents-3:214001-267000","Adult-1,Dependents-3","214001-267000",{"$f":"(1056)*52.2/12","v":4593.6000000000004}]
["Adult-1,Dependents-3:267001-321000","Adult-1,Dependents-3","267001-321000",{"$f":"(1188)*52.2/12","v":5167.8}]
["Adult-1,Dependents-3:321000+","Adult-1,Dependents-3","321000+",{"$f":"(1220)*52.2/12","v":5307}]
[]
[]
[{"$f":"B148 & \":\" & C148","v":"Adult-1,Dependents-4:0-21000"},"Adult-1,Dependents-4","0-21000",{"$f":"(552+93)*52.2/12","v":2805.75}]
["Adult-1,Dependents-4:21000-32000","Adult-1,Dependents-4","21000-32000",{"$f":"(552+93)*52.2/12","v":2805.75}]
["Adult-1,Dependents-4:32001-43000","Adult-1,Dependents-4","32001-43000",{"$f":"(552+93)*52.2/12","v":2805.75}]
["Adult-1,Dependents-4:43001-53000","Adult-1,Dependents-4","43001-53000",{"$f":"(574+93)*52.2/12","v":2901.4500000000003}]
["Adult-1,Dependents-4:53001-64000","Adult-1,Dependents-4","53001-64000",{"$f":"(612+93)*52.2/12","v":3066.75}]
["Adult-1,Dependents-4:64001-85000","Adult-1,Dependents-4","64001-85000",{"$f":"(659+93)*52.2/12","v":3271.2000000000003}]
["Adult-1,Dependents-4:85001-107000","Adult-1,Dependents-4","85001-107000",{"$f":"(733+93)*52.2/12","v":3593.1000000000004}]
["Adult-1,Dependents-4:107001-128000","Adult-1,Dependents-4","107001-128000",{"$f":"(787+94)*52.2/12","v":3832.3500000000004}]
["Adult-1,Dependents-4:128001-150000","Adult-1,Dependents-4","128001-150000",{"$f":"(878+94)*52.2/12","v":4228.2}]
["Adult-1,Dependents-4:150001-171000","Adult-1,Dependents-4","150001-171000",{"$f":"(912+94)*52.2/12","v":4376.1000000000004}]
["Adult-1,Dependents-4:171001-214000","Adult-1,Dependents-4","171001-214000",{"$f":"(951+94)*52.2/12","v":4545.75}]
["Adult-1,Dependents-4:214001-267000","Adult-1,Dependents-4","214001-267000",{"$f":"(1056+95)*52.2/12","v":5006.8500000000004}]
["Adult-1,Dependents-4:267001-321000","Adult-1,Dependents-4","267001-321000",{"$f":"(1188+95)*52.2/12","v":5581.05}]
["Adult-1,Dependents-4:321000+","Adult-1,Dependents-4","321000+",{"$f":"(1220+95)*52.2/12","v":5720.25}]
[]
[{"$f":"B163 & \":\" & C163","v":"Adult-1,Dependents-5:0-21000"},"Adult-1,Dependents-5","0-21000",{"$f":"(612+93+93)*52.2/12","v":3471.3000000000006}]
["Adult-1,Dependents-5:21000-32000","Adult-1,Dependents-5","21000-32000",{"$f":"(612+93+93)*52.2/12","v":3471.3000000000006}]
["Adult-1,Dependents-5:32001-43000","Adult-1,Dependents-5","32001-43000",{"$f":"(612+93+93)*52.2/12","v":3471.3000000000006}]
["Adult-1,Dependents-5:43001-53000","Adult-1,Dependents-5","43001-53000",{"$f":"(612+93+93)*52.2/12","v":3471.3000000000006}]
["Adult-1,Dependents-5:53001-64000","Adult-1,Dependents-5","53001-64000",{"$f":"(612+93+93)*52.2/12","v":3471.3000000000006}]
["Adult-1,Dependents-5:64001-85000","Adult-1,Dependents-5","64001-85000",{"$f":"(659+93+93)*52.2/12","v":3675.75}]
["Adult-1,Dependents-5:85001-107000","Adult-1,Dependents-5","85001-107000",{"$f":"(733+93+93)*52.2/12","v":3997.65}]
["Adult-1,Dependents-5:107001-128000","Adult-1,Dependents-5","107001-128000",{"$f":"(787+94+94)*52.2/12","v":4241.25}]
["Adult-1,Dependents-5:128001-150000","Adult-1,Dependents-5","128001-150000",{"$f":"(878+94+94)*52.2/12","v":4637.1000000000004}]
["Adult-1,Dependents-5:150001-171000","Adult-1,Dependents-5","150001-171000",{"$f":"(912+94+94)*52.2/12","v":4785}]
["Adult-1,Dependents-5:171001-214000","Adult-1,Dependents-5","171001-214000",{"$f":"(951+94+94)*52.2/12","v":4954.6500000000005}]
["Adult-1,Dependents-5:214001-267000","Adult-1,Dependents-5","214001-267000",{"$f":"(1056+95+95)*52.2/12","v":5420.1}]
["Adult-1,Dependents-5:267001-321000","Adult-1,Dependents-5","267001-321000",{"$f":"(1188+95+95)*52.2/12","v":5994.3}]
["Adult-1,Dependents-5:321000+","Adult-1,Dependents-5","321000+",{"$f":"(1220+95+95)*52.2/12","v":6133.5}]
[]
[{"$f":"B178 & \":\" & C178","v":"Adult-1,Dependents-6:0-21000"},"Adult-1,Dependents-6","0-21000",{"$f":"(659+93+93)*52.2/12","v":3675.75}]
["Adult-1,Dependents-6:21000-32000","Adult-1,Dependents-6","21000-32000",3675.75]
["Adult-1,Dependents-6:32001-43000","Adult-1,Dependents-6","32001-43000",3675.75]
["Adult-1,Dependents-6:43001-53000","Adult-1,Dependents-6","43001-53000",3675.75]
["Adult-1,Dependents-6:53001-64000","Adult-1,Dependents-6","53001-64000",3675.75]
["Adult-1,Dependents-6:64001-85000","Adult-1,Dependents-6","64001-85000",3675.75]
["Adult-1,Dependents-6:85001-107000","Adult-1,Dependents-6","85001-107000",{"$f":"(733+93+93+93)*52.2/12","v":4402.2}]
["Adult-1,Dependents-6:107001-128000","Adult-1,Dependents-6","107001-128000",{"$f":"(787+94+94+94)*52.2/12","v":4650.1500000000005}]
["Adult-1,Dependents-6:128001-150000","Adult-1,Dependents-6","128001-150000",{"$f":"(878+94+94+94)*52.2/12","v":5046}]
["Adult-1,Dependents-6:150001-171000","Adult-1,Dependents-6","150001-171000",{"$f":"(912+94+94+94)*52.2/12","v":5193.9000000000005}]
["Adult-1,Dependents-6:171001-214000","Adult-1,Dependents-6","171001-214000",{"$f":"(951+94+94+94)*52.2/12","v":5363.55}]
["Adult-1,Dependents-6:214001-267000","Adult-1,Dependents-6","214001-267000",{"$f":"(1056+95+95+95)*52.2/12","v":5833.3499999999995}]
["Adult-1,Dependents-6:267001-321000","Adult-1,Dependents-6","267001-321000",{"$f":"(1188+95+95+95)*52.2/12","v":6407.55}]
["Adult-1,Dependents-6:321000+","Adult-1,Dependents-6","321000+",{"$f":"(1220+95+95+95)*52.2/12","v":6546.75}]
[]
[{"$f":"B193 & \":\" & C193","v":"Adult-2,Dependents-0:0-21000"},"Adult-2,Dependents-0","0-21000",{"$f":"487*52.2/12","v":2118.4500000000003}]
[{"$f":"B194 & \":\" & C194","v":"Adult-2,Dependents-0:21000-32000"},"Adult-2,Dependents-0","21000-32000",{"$f":"487*52.2/12","v":2118.4500000000003}]
["Adult-2,Dependents-0:32001-43000","Adult-2,Dependents-0","32001-43000",{"$f":"502*52.2/12","v":2183.7000000000003}]
["Adult-2,Dependents-0:43001-53000","Adult-2,Dependents-0","43001-53000",{"$f":"523*52.2/12","v":2275.0500000000002}]
["Adult-2,Dependents-0:53001-64000","Adult-2,Dependents-0","53001-64000",{"$f":"561*52.2/12","v":2440.35}]
["Adult-2,Dependents-0:64001-85000","Adult-2,Dependents-0","64001-85000",{"$f":"608*52.2/12","v":2644.8}]
["Adult-2,Dependents-0:85001-107000","Adult-2,Dependents-0","85001-107000",{"$f":"682*52.2/12","v":2966.7000000000003}]
["Adult-2,Dependents-0:107001-128000","Adult-2,Dependents-0","107001-128000",{"$f":"735*52.2/12","v":3197.25}]
["Adult-2,Dependents-0:128001-150000","Adult-2,Dependents-0","128001-150000",{"$f":"826*52.2/12","v":3593.1000000000004}]
["Adult-2,Dependents-0:150001-171000","Adult-2,Dependents-0","150001-171000",{"$f":"860*52.2/12","v":3741}]
["Adult-2,Dependents-0:171001-214000","Adult-2,Dependents-0","171001-214000",{"$f":"899*52.2/12","v":3910.65}]
["Adult-2,Dependents-0:214001-267000","Adult-2,Dependents-0","214001-267000",{"$f":"1004*52.2/12","v":4367.4000000000005}]
["Adult-2,Dependents-0:267001-321000","Adult-2,Dependents-0","267001-321000",{"$f":"1135*52.2/12","v":4937.25}]
["Adult-2,Dependents-0:321000+","Adult-2,Dependents-0","321000+",{"$f":"1167*52.2/12","v":5076.45}]
[]
[{"$f":"B208 & \":\" & C208","v":"Adult-2,Dependents-1:0-21000"},"Adult-2,Dependents-1","0-21000",{"$f":"578*52.2/12","v":2514.3000000000002}]
["Adult-2,Dependents-1:21000-32000","Adult-2,Dependents-1","21000-32000",{"$f":"578*52.2/12","v":2514.3000000000002}]
["Adult-2,Dependents-1:32001-43000","Adult-2,Dependents-1","32001-43000",{"$f":"578*52.2/12","v":2514.3000000000002}]
["Adult-2,Dependents-1:43001-53000","Adult-2,Dependents-1","43001-53000",{"$f":"599*52.2/12","v":2605.65}]
["Adult-2,Dependents-1:53001-64000","Adult-2,Dependents-1","53001-64000",{"$f":"637*52.2/12","v":2770.9500000000003}]
["Adult-2,Dependents-1:64001-85000","Adult-2,Dependents-1","64001-85000",{"$f":"684*52.2/12","v":2975.4}]
["Adult-2,Dependents-1:85001-107000","Adult-2,Dependents-1","85001-107000",{"$f":"757*52.2/12","v":3292.9500000000003}]
["Adult-2,Dependents-1:107001-128000","Adult-2,Dependents-1","107001-128000",{"$f":"811*52.2/12","v":3527.8500000000004}]
["Adult-2,Dependents-1:128001-150000","Adult-2,Dependents-1","128001-150000",{"$f":"901*52.2/12","v":3919.3500000000004}]
["Adult-2,Dependents-1:150001-171000","Adult-2,Dependents-1","150001-171000",{"$f":"935*52.2/12","v":4067.25}]
["Adult-2,Dependents-1:171001-214000","Adult-2,Dependents-1","171001-214000",{"$f":"974*52.2/12","v":4236.9000000000005}]
["Adult-2,Dependents-1:214001-267000","Adult-2,Dependents-1","214001-267000",{"$f":"1079*52.2/12","v":4693.6500000000005}]
["Adult-2,Dependents-1:267001-321000","Adult-2,Dependents-1","267001-321000",{"$f":"1210*52.2/12","v":5263.5}]
["Adult-2,Dependents-1:321000+","Adult-2,Dependents-1","321000+",{"$f":"1241*52.2/12","v":5398.35}]
[]
[{"$f":"B223 & \":\" & C223","v":"Adult-2,Dependents-2:0-21000"},"Adult-2,Dependents-2","0-21000",{"$f":"636*52.2/12","v":2766.6000000000004}]
["Adult-2,Dependents-2:21000-32000","Adult-2,Dependents-2","21000-32000",{"$f":"636*52.2/12","v":2766.6000000000004}]
["Adult-2,Dependents-2:32001-43000","Adult-2,Dependents-2","32001-43000",{"$f":"636*52.2/12","v":2766.6000000000004}]
["Adult-2,Dependents-2:43001-53000","Adult-2,Dependents-2","43001-53000",{"$f":"657*52.2/12","v":2857.9500000000003}]
["Adult-2,Dependents-2:53001-64000","Adult-2,Dependents-2","53001-64000",{"$f":"694*52.2/12","v":3018.9}]
["Adult-2,Dependents-2:64001-85000","Adult-2,Dependents-2","64001-85000",{"$f":"741*52.2/12","v":3223.3500000000004}]
["Adult-2,Dependents-2:85001-107000","Adult-2,Dependents-2","85001-107000",{"$f":"815*52.2/12","v":3545.25}]
["Adult-2,Dependents-2:107001-128000","Adult-2,Dependents-2","107001-128000",{"$f":"868*52.2/12","v":3775.8000000000006}]
["Adult-2,Dependents-2:128001-150000","Adult-2,Dependents-2","128001-150000",{"$f":"959*52.2/12","v":4171.6500000000005}]
["Adult-2,Dependents-2:150001-171000","Adult-2,Dependents-2","150001-171000",{"$f":"993*52.2/12","v":4319.55}]
["Adult-2,Dependents-2:171001-214000","Adult-2,Dependents-2","171001-214000",{"$f":"1032*52.2/12","v":4489.2}]
["Adult-2,Dependents-2:214001-267000","Adult-2,Dependents-2","214001-267000",{"$f":"1136*52.2/12","v":4941.6000000000004}]
["Adult-2,Dependents-2:267001-321000","Adult-2,Dependents-2","267001-321000",{"$f":"1268*52.2/12","v":5515.8}]
["Adult-2,Dependents-2:321000+","Adult-2,Dependents-2","321000+",{"$f":"1299*52.2/12","v":5650.6500000000005}]
[]
[{"$f":"B238 & \":\" & C238","v":"Adult-2,Dependents-3:0-21000"},"Adult-2,Dependents-3","0-21000",{"$f":"720*52.2/12","v":3132}]
["Adult-2,Dependents-3:21000-32000","Adult-2,Dependents-3","21000-32000",{"$f":"720*52.2/12","v":3132}]
["Adult-2,Dependents-3:32001-43000","Adult-2,Dependents-3","32001-43000",{"$f":"720*52.2/12","v":3132}]
["Adult-2,Dependents-3:43001-53000","Adult-2,Dependents-3","43001-53000",{"$f":"720*52.2/12","v":3132}]
["Adult-2,Dependents-3:53001-64000","Adult-2,Dependents-3","53001-64000",{"$f":"757*52.2/12","v":3292.9500000000003}]
["Adult-2,Dependents-3:64001-85000","Adult-2,Dependents-3","64001-85000",{"$f":"804*52.2/12","v":3497.4}]
["Adult-2,Dependents-3:85001-107000","Adult-2,Dependents-3","85001-107000",{"$f":"878*52.2/12","v":3819.3000000000006}]
["Adult-2,Dependents-3:107001-128000","Adult-2,Dependents-3","107001-128000",{"$f":"931*52.2/12","v":4049.8500000000004}]
["Adult-2,Dependents-3:128001-150000","Adult-2,Dependents-3","128001-150000",{"$f":"1022*52.2/12","v":4445.7}]
["Adult-2,Dependents-3:150001-171000","Adult-2,Dependents-3","150001-171000",{"$f":"1056*52.2/12","v":4593.6000000000004}]
["Adult-2,Dependents-3:171001-214000","Adult-2,Dependents-3","171001-214000",{"$f":"1095*52.2/12","v":4763.25}]
["Adult-2,Dependents-3:214001-267000","Adult-2,Dependents-3","214001-267000",{"$f":"1199*52.2/12","v":5215.6500000000005}]
["Adult-2,Dependents-3:267001-321000","Adult-2,Dependents-3","267001-321000",{"$f":"1330*52.2/12","v":5785.5}]
["Adult-2,Dependents-3:321000+","Adult-2,Dependents-3","321000+",{"$f":"1362*52.2/12","v":5924.7000000000007}]
[]
[]
[{"$f":"B254 & \":\" & C254","v":"Adult-2,Dependents-4:0-21000"},"Adult-2,Dependents-4","0-21000",{"$f":"(757+63)*52.2/12","v":3567}]
["Adult-2,Dependents-4:21000-32000","Adult-2,Dependents-4","21000-32000",{"$f":"(757+63)*52.2/12","v":3567}]
["Adult-2,Dependents-4:32001-43000","Adult-2,Dependents-4","32001-43000",{"$f":"(757+63)*52.2/12","v":3567}]
["Adult-2,Dependents-4:43001-53000","Adult-2,Dependents-4","43001-53000",{"$f":"(757+63)*52.2/12","v":3567}]
["Adult-2,Dependents-4:53001-64000","Adult-2,Dependents-4","53001-64000",{"$f":"(757+63)*52.2/12","v":3567}]
["Adult-2,Dependents-4:64001-85000","Adult-2,Dependents-4","64001-85000",{"$f":"(804+63)*52.2/12","v":3771.4500000000003}]
["Adult-2,Dependents-4:85001-107000","Adult-2,Dependents-4","85001-107000",{"$f":"(878+63)*52.2/12","v":4093.3500000000004}]
["Adult-2,Dependents-4:107001-128000","Adult-2,Dependents-4","107001-128000",{"$f":"(931+63)*52.2/12","v":4323.9000000000005}]
["Adult-2,Dependents-4:128001-150000","Adult-2,Dependents-4","128001-150000",{"$f":"(1022+63)*52.2/12","v":4719.75}]
["Adult-2,Dependents-4:150001-171000","Adult-2,Dependents-4","150001-171000",{"$f":"(1056+63)*52.2/12","v":4867.6500000000005}]
["Adult-2,Dependents-4:171001-214000","Adult-2,Dependents-4","171001-214000",{"$f":"(1095+63)*52.2/12","v":5037.3}]
["Adult-2,Dependents-4:214001-267000","Adult-2,Dependents-4","214001-267000",{"$f":"(1199+63)*52.2/12","v":5489.7000000000007}]
["Adult-2,Dependents-4:267001-321000","Adult-2,Dependents-4","267001-321000",{"$f":"(1330+63)*52.2/12","v":6059.55}]
["Adult-2,Dependents-4:321000+","Adult-2,Dependents-4","321000+",{"$f":"(1362+63)*52.2/12","v":6198.75}]
[]
[{"$f":"B269 & \":\" & C269","v":"Adult-2,Dependents-5:0-21000"},"Adult-2,Dependents-5","0-21000",{"$f":"(757+63+63)*52.2/12","v":3841.0500000000006}]
["Adult-2,Dependents-5:21000-32000","Adult-2,Dependents-5","21000-32000",{"$f":"(757+63+63)*52.2/12","v":3841.0500000000006}]
["Adult-2,Dependents-5:32001-43000","Adult-2,Dependents-5","32001-43000",{"$f":"(757+63+63)*52.2/12","v":3841.0500000000006}]
["Adult-2,Dependents-5:43001-53000","Adult-2,Dependents-5","43001-53000",{"$f":"(757+63+63)*52.2/12","v":3841.0500000000006}]
["Adult-2,Dependents-5:53001-64000","Adult-2,Dependents-5","53001-64000",{"$f":"(757+63+63)*52.2/12","v":3841.0500000000006}]
["Adult-2,Dependents-5:64001-85000","Adult-2,Dependents-5","64001-85000",{"$f":"(804+63+63)*52.2/12","v":4045.5}]
["Adult-2,Dependents-5:85001-107000","Adult-2,Dependents-5","85001-107000",{"$f":"(878+63+63)*52.2/12","v":4367.4000000000005}]
["Adult-2,Dependents-5:107001-128000","Adult-2,Dependents-5","107001-128000",{"$f":"(931+63+63)*52.2/12","v":4597.95}]
["Adult-2,Dependents-5:128001-150000","Adult-2,Dependents-5","128001-150000",{"$f":"(1022+63+63)*52.2/12","v":4993.8}]
["Adult-2,Dependents-5:150001-171000","Adult-2,Dependents-5","150001-171000",{"$f":"(1056+63+63)*52.2/12","v":5141.7}]
["Adult-2,Dependents-5:171001-214000","Adult-2,Dependents-5","171001-214000",{"$f":"(1095+63+63)*52.2/12","v":5311.35}]
["Adult-2,Dependents-5:214001-267000","Adult-2,Dependents-5","214001-267000",{"$f":"(1199+63+63)*52.2/12","v":5763.75}]
["Adult-2,Dependents-5:267001-321000","Adult-2,Dependents-5","267001-321000",{"$f":"(1330+63+63)*52.2/12","v":6333.5999999999995}]
["Adult-2,Dependents-5:321000+","Adult-2,Dependents-5","321000+",{"$f":"(1362+63+63)*52.2/12","v":6472.8}]
[]
[{"$f":"B284 & \":\" & C284","v":"Adult-2,Dependents-6:0-21000"},"Adult-2,Dependents-6","0-21000",{"$f":"(804+63+63)*52.2/12","v":4045.5}]
["Adult-2,Dependents-6:21000-32000","Adult-2,Dependents-6","21000-32000",4045.5]
["Adult-2,Dependents-6:32001-43000","Adult-2,Dependents-6","32001-43000",4045.5]
["Adult-2,Dependents-6:43001-53000","Adult-2,Dependents-6","43001-53000",4045.5]
["Adult-2,Dependents-6:53001-64000","Adult-2,Dependents-6","53001-64000",4045.5]
["Adult-2,Dependents-6:64001-85000","Adult-2,Dependents-6","64001-85000",4045.5]
["Adult-2,Dependents-6:85001-107000","Adult-2,Dependents-6","85001-107000",{"$f":"(878+63+63)*52.2/12","v":4367.4000000000005}]
["Adult-2,Dependents-6:107001-128000","Adult-2,Dependents-6","107001-128000",{"$f":"(931+63+63)*52.2/12","v":4597.95}]
["Adult-2,Dependents-6:128001-150000","Adult-2,Dependents-6","128001-150000",{"$f":"(1022+63+63)*52.2/12","v":4993.8}]
["Adult-2,Dependents-6:150001-171000","Adult-2,Dependents-6","150001-171000",{"$f":"(1056+63+63)*52.2/12","v":5141.7}]
["Adult-2,Dependents-6:171001-214000","Adult-2,Dependents-6","171001-214000",{"$f":"(1095+63+63)*52.2/12","v":5311.35}]
["Adult-2,Dependents-6:214001-267000","Adult-2,Dependents-6","214001-267000",{"$f":"(1199+63+63)*52.2/12","v":5763.75}]
["Adult-2,Dependents-6:267001-321000","Adult-2,Dependents-6","267001-321000",{"$f":"(1330+63+63)*52.2/12","v":6333.5999999999995}]
["Adult-2,Dependents-6:321000+","Adult-2,Dependents-6","321000+",{"$f":"(1362+63+63)*52.2/12","v":6472.8}]
[]
[]
[null,"Household 1","Household 2"]
["Household Key",{"$f":"B84","v":"Adult-1,Dependents-2"},{"$f":"C84","v":"Adult-2,Dependents-3"}]
["Salary Key",{"$f":"IF(B76<=0,\"0-21000\",IF(B76<=21000,\"0-21000\",IF(B76<=32000,\"21000-32000\",IF(B76<=43000,\"32001-43000\",IF(B76<=53000,\"43001-53000\",IF(B76<=64000,\"53001-64000\",IF(B76<=85000,\"64001-85000\",IF(B76<=107000,\"85001-107000\",IF(B76<=128000,\"107001-128000\",IF(B76<=150000,\"128001-150000\",IF(B76<=171000,\"150001-171000\",IF(B76<=214000,\"171001-214000\",IF(B76<=267000,\"214001-267000\",IF(B76<=321000,\"267001-321000\",IF(B76>321000,\"321000+\",FALSE)))))))))))))))","v":"85001-107000"},{"$f":"IF(C76<=0,\"0-21000\",IF(C76<=21000,\"0-21000\",IF(C76<=32000,\"21000-32000\",IF(C76<=43000,\"32001-43000\",IF(C76<=53000,\"43001-53000\",IF(C76<=64000,\"53001-64000\",IF(C76<=85000,\"64001-85000\",IF(C76<=107000,\"85001-107000\",IF(C76<=128000,\"107001-128000\",IF(C76<=150000,\"128001-150000\",IF(C76<=171000,\"150001-171000\",IF(C76<=214000,\"171001-214000\",IF(C76<=267000,\"214001-267000\",IF(C76<=321000,\"267001-321000\",IF(C76>321000,\"321000+\",FALSE)))))))))))))))","v":"128001-150000"}]
["Household Living Expense",{"$f":"HEM!F46","v":2811.4412082129129},{"$f":"HEM!J46","v":4426.1904067346686}]
[]
[]
[]
[]
["Monthly expense",{"$f":"MAX(SUM(B303:C303),Serviceability!G38)","v":7237.6316149475815}]
[]
[]
["Avaiable Income",{"$f":"Serviceability!L32-Tables!B308","v":7949.5971350524169}]
[]
[]
[]
[]
[]
["RedZed Loan Applied For Loan1",{"$f":"IF(Serviceability!H55=0,0,IF(Serviceability!J55=0,0,-PMT((Serviceability!J55)/12,(Serviceability!H55-Serviceability!I55)*12,Serviceability!G55)))","v":0}]
["RedZed Loan Applied For Loan2",{"$f":"IF(Serviceability!H56=0,0,IF(Serviceability!J56=0,0,-PMT((Serviceability!J56)/12,(Serviceability!H56-Serviceability!I56)*12,Serviceability!G56)))","v":0}]

{"sheet":"Serviceability Calc","index":3,"n_rows":19,"n_cols":3,"rows_kept":19,"cut":false,"hidden":true,"merged":[[0,0,0,1]]}
["Serviceability Cell Calculation"]
[]
[null,{"$f":"Serviceability!D49&\" (After Tax Rates Applied)\"","v":"Available Income (After Tax Rates Applied)"},{"$f":"Serviceability!L49","v":7949.5971350524169}]
[null,"Divided by"]
[null,{"$f":"Serviceability!D71","v":"Total Monthly Commitments"},{"$f":"SUM(Serviceability!L55:L70)","v":0}]
["Less",{"$f":"Serviceability!$D$53&\" - \"&Serviceability!E55","v":"RedZed Loan Applied For - Loan 1"},{"$f":"-Serviceability!L55","v":0}]
["Less",{"$f":"Serviceability!$D$53&\" - \"&Serviceability!E56","v":"RedZed Loan Applied For - Loan 2"},{"$f":"-Serviceability!L56","v":0}]
["Plus",{"$f":"Serviceability!$D$53&\" - \"&Tables!A32","v":"RedZed Loan Applied For - Buffered Loan 1"},{"$f":"Tables!B32","v":0}]
["Plus",{"$f":"Serviceability!$D$53&\" - \"&Tables!A33","v":"RedZed Loan Applied For - Buffered Loan 2"},{"$f":"Tables!B33","v":0}]
["Less",{"$f":"Serviceability!$D$59&\": \"&Serviceability!E59","v":"Existing Loans: Loan 1 - Existing Secured"},{"$f":"-Serviceability!L59","v":0}]
["Less",{"$f":"Serviceability!$D$59&\": \"&Serviceability!E60","v":"Existing Loans: Loan 2 - Existing Secured"},{"$f":"-Serviceability!L60","v":0}]
["Plus",{"$f":"Serviceability!$D$59&\": \"&Tables!A37","v":"Existing Loans: Buffered Loan 1"},{"$f":"Tables!C37","v":0}]
["Plus",{"$f":"Serviceability!$D$59&\": \"&Tables!A38","v":"Existing Loans: Buffered Loan 2"},{"$f":"Tables!C38","v":0}]
["Plus",{"$f":"Tables!A42","v":"Fees - Loan 1"},{"$f":"Tables!C42","v":0}]
["Plus",{"$f":"Tables!A43","v":"Fees - Loan 2"},{"$f":"Tables!C43","v":0}]
[]
[null,"Total Monthly Commitments (After Repayment Buffering & Fees)",{"$f":"SUM(C5:C16)","v":0}]
[]
[null,{"$f":"Serviceability!I74&\" - Calculated as:\"","v":" - Calculated as:"},{"$f":"ROUNDUP(C3/C17,2)","v":{"$error":"#DIV/0!"}}]

{"sheet":"Tax Calc","index":4,"n_rows":51,"n_cols":11,"rows_kept":51,"cut":false,"hidden":true,"merged":[]}
["Tax Calc"]
[]
["Annual Gross",null,null,"Gross","Tax","Medicare","Income offset","Net","Net Monthly"]
[]
["Applicant / G'Tor 1","Salary / Self Employed",null,{"$f":"Serviceability!G13","v":100000},{"$f":"IF(D5<Tables!$A$6,0,IF(AND(D5>Tables!$A$6,D5<Tables!$A$7),(D5-Tables!$A$6)*Tables!$C$6,IF(AND(D5>Tables!$A$7,D5<Tables!$A$8),Tables!$D$7+(D5-Tables!$A$7)*Tables!$C$7,IF(AND(D5>Tables!$A$8,D5<Tables!$A$9),Tables!$D$8+(D5-Tables!$A$8)*Tables!$C$8,IF(D5>Tables!$A$9,Tables!$D$9+(D5-Tables!$A$9)*Tables!$C$9)))))","v":22966.674999999999},{"$f":"D5*Tables!C$16","v":2000},{"$f":"IFERROR(((D5-VLOOKUP(D5,$A$29:$D$33,1,TRUE))*VLOOKUP(D5,$A$29:$D$33,3,TRUE)+VLOOKUP(D5,$A$29:$D$33,4,TRUE)),0)+IFERROR((IF(D5>66667,66667-45001,(D5-VLOOKUP(D5,$A$41:$D$43,1,TRUE)))*VLOOKUP(D5,$A$41:$D$43,3,TRUE)+VLOOKUP(D5,$A$41:$D$43,4,TRUE)),0)","v":780.04},{"$f":"D5-E5-F5+G5","v":75813.364999999991},{"$f":"H5/12","v":6317.7804166666656}]
["Applicant / G'Tor 2","Salary / Self Employed",null,{"$f":"Serviceability!G14","v":150000},{"$f":"IF(D6<Tables!$A$6,0,IF(AND(D6>=Tables!$A$6,D6<Tables!$A$7),(D6-Tables!$A$6)*Tables!$C$6,IF(AND(D6>=Tables!$A$7,D6<Tables!$A$8),Tables!$D$7+(D6-Tables!$A$7)*Tables!$C$7,IF(AND(D6>=Tables!$A$8,D6<Tables!$A$9),Tables!$D$8+(D6-Tables!$A$8)*Tables!$C$8,IF(D6>=Tables!$A$9,Tables!$D$9+(D6-Tables!$A$9)*Tables!$C$9)))))","v":40566.629999999997},{"$f":"D6*Tables!C$16","v":3000},{"$f":"IFERROR(((D6-VLOOKUP(D6,$A$29:$D$33,1,TRUE))*VLOOKUP(D6,$A$29:$D$33,3,TRUE)+VLOOKUP(D6,$A$29:$D$33,4,TRUE)),0)+IFERROR((IF(D6>66667,66667-45001,(D6-VLOOKUP(D6,$A$41:$D$43,1,TRUE)))*VLOOKUP(D6,$A$41:$D$43,3,TRUE)+VLOOKUP(D6,$A$41:$D$43,4,TRUE)),0)","v":9.9999999999909051E-3},{"$f":"D6-E6-F6+G6","v":106433.37999999999},{"$f":"H6/12","v":8869.4483333333319}]
["Applicant / G'Tor 3","Salary / Self Employed",null,{"$f":"Serviceability!G15","v":0},{"$f":"IF(D7<Tables!$A$6,0,IF(AND(D7>=Tables!$A$6,D7<Tables!$A$7),(D7-Tables!$A$6)*Tables!$C$6,IF(AND(D7>=Tables!$A$7,D7<Tables!$A$8),Tables!$D$7+(D7-Tables!$A$7)*Tables!$C$7,IF(AND(D7>=Tables!$A$8,D7<Tables!$A$9),Tables!$D$8+(D7-Tables!$A$8)*Tables!$C$8,IF(D7>=Tables!$A$9,Tables!$D$9+(D7-Tables!$A$9)*Tables!$C$9)))))","v":0},{"$f":"D7*Tables!C$16","v":0},0,0,{"$f":"H7/12","v":0}]
["Applicant / G'Tor 4","Salary / Self Employed",null,{"$f":"Serviceability!G16","v":0},{"$f":"IF(D8<Tables!$A$6,0,IF(AND(D8>=Tables!$A$6,D8<Tables!$A$7),(D8-Tables!$A$6)*Tables!$C$6,IF(AND(D8>=Tables!$A$7,D8<Tables!$A$8),Tables!$D$7+(D8-Tables!$A$7)*Tables!$C$7,IF(AND(D8>=Tables!$A$8,D8<Tables!$A$9),Tables!$D$8+(D8-Tables!$A$8)*Tables!$C$8,IF(D8>=Tables!$A$9,Tables!$D$9+(D8-Tables!$A$9)*Tables!$C$9)))))","v":0},{"$f":"D8*Tables!C$16","v":0},0,0,{"$f":"H8/12","v":0}]
[]
[]
[]
[]
[]
[]
[]
[]
[]
[]
["Test lower and middle income offset",null,null,"Formula","( income - income lower range ) *offset rate + baseline"]
[]
["income","offset baseline","Income lower range","Income - Lower range","offset reduced %","offset reduced amount","offset amount"]
[80000,{"$f":"VLOOKUP(A22,A29:D33,4,TRUE)","v":1080},{"$f":"VLOOKUP(A22,A29:D33,1,TRUE)","v":48001},{"$f":" A22-C22","v":31999},{"$f":"VLOOKUP(A22,A29:D33,3,TRUE)","v":0},{"$f":"+D22*E22","v":0},{"$f":"SUM(B22,F22)","v":1080}]
[]
[]
[]
["Lower and Middle income offset"]
[]
["Wages Over","Not to Exceed","Tax Rate"]
[1,37000,null,255]
[{"$f":"B29+1","v":37001},48000,7.4999999999999997E-2,255]
[{"$f":"B30+1","v":48001},90000,0,1080]
[{"$f":"B31+1","v":90001},126000,-0.03,1080]
[{"$f":"B32+1","v":126001},null,0,0]
[]
[]
[]
[]
["Low Income offset"]
[]
["Wages Over","Not to Exceed","Tax Rate"]
[1,37500,null,700,null,null,null,null,null,null,{"$f":"I41*52","v":0}]
[{"$f":"B41+1","v":37501},45000,-0.05,700]
[{"$f":"B42+1","v":45001},66667,-1.4999999999999999E-2,325]
[]
[]
[]
[]
["Test low income"]
[]
["income","offset baseline","Income lower range","Income - Lower range","offset reduced %","offset reduced amount","offset amount"]
[80000,{"$f":"VLOOKUP(A51,A41:D43,4,TRUE)","v":325},{"$f":"VLOOKUP(A51,A41:D43,1,TRUE)","v":45001},{"$f":"IF(A51>66667, 66667-45001, A51-C51)","v":21666},{"$f":"VLOOKUP(A51,A41:D43,3,TRUE)","v":-1.4999999999999999E-2},{"$f":"+D51*E51","v":-324.99},{"$f":"SUM(B51,F51)","v":9.9999999999909051E-3}]

{"sheet":"User Problems","index":5,"n_rows":34,"n_cols":17,"rows_kept":34,"cut":false,"hidden":true,"merged":[]}
["#","Date","Submitted By","Sheet Name (if applicable)","Problem","Initial Review Assessment","Review Result Date","Review With User","Review Result or Action to Take","Sheets Affected","Development Version #","Type","Estimate (hrs)","Actual","Status","Date Unit Tested","Release Version #"]
[1,"2017-04-06","Bill Slattery",null,"What we are trying to achieve is a stress test of servicing capacity at the higher of;\n1. The selected interest rate + 2% or \n2. 7% \nThis change should only apply to Residential loans.\n",null,null,null,null,null,{"$f":"'Version Control'!C2","v":"V6.4 Test"},"Enhancement",null,null,"Completed","2017-04-10",{"$f":"'Version Control'!$C$9","v":"v6.5"}]
[2,"2017-04-10","Trevor Smith",null,"The tax table in the Residential calculator is not the same as in the Consolidated Calculator. Looks like the Residential Calculator was not updated for the 2017/2018 change to the upper limit for the 32.5% rate (ie from $80000 to $87000).","Change the tax table in the Residential Calculator in expectation you want it to match that in the Consolidated Calculator.","2017-04-10","Bill Slattery","Change as recommended",null,{"$f":"'Version Control'!C3","v":"V6.4 Test2  (v6.42)"},"Bug",null,null,"Completed","2017-04-10",{"$f":"'Version Control'!$C$9","v":"v6.5"}]
[3,"2017-04-24","Bill Slattery","Serviceability Calc","Add Serviceabilty Calculation Sheet as per Consolidated User Problem #131.","Name as \"Serviceability Calc\"",null,null,null,null,{"$f":"'Version Control'!$C$4","v":"V6.6 Test (v6.43)"},"Enhancement",null,null,"Completed","2017-05-01",{"$f":"'Version Control'!$C$9","v":"v6.5"}]
[4,"2017-04-24","Mario Lorenzi",null,"Add two macros:\n-Ctl/Shift/B to unhide the calculation sheets\n-Ctl/Shift/H to hide the calculation sheets\n",null,null,null,null,null,{"$f":"'Version Control'!$C$4","v":"V6.6 Test (v6.43)"},"Enhancement",null,null,"Completed","2017-05-01",{"$f":"'Version Control'!$C$9","v":"v6.5"}]
[5,"2017-04-24","Mario Lorenzi","Tables","Change Company Tax Rate to 28.5%","Set up a  a new Company Tax Table on Tables sheet. Change Company Income Calculation (Cell K18) to reference the new Company Tax Table.",null,null,null,null,{"$f":"'Version Control'!$C$4","v":"V6.6 Test (v6.43)"},"Data Maintenance",null,null,"Completed","2017-05-01",{"$f":"'Version Control'!$C$9","v":"v6.5"}]
[6,"2017-04-24","Mario Lorenzi","Serviceability","Add Interest Only Term cells for RedZed Loans 1 and 2 on Serviceability sheet.\nChange the Rate buffering calculation to use the net term (Total Term less Interest Only Term)",null,null,null,null,null,{"$f":"'Version Control'!$C$4","v":"V6.6 Test (v6.43)"},"Enhancement",null,null,"Completed","2017-05-01",{"$f":"'Version Control'!$C$9","v":"v6.5"}]
[7,"2017-04-24","Mario Lorenzi","Serviceability","Add Source of Other Incomes cell for each of the Other Regular Monthly Income lines on the Serviceability sheets.",null,null,null,null,null,{"$f":"'Version Control'!$C$4","v":"V6.6 Test (v6.43)"},"Enhancement",null,null,"Completed","2017-05-01",{"$f":"'Version Control'!$C$9","v":"v6.5"}]
[8,"2017-04-24","Mario Lorenzi","Serviceability","Change Company Income heading to display \"Company Income (if applicable)\"",null,null,null,null,null,{"$f":"'Version Control'!$C$4","v":"V6.6 Test (v6.43)"},"Enhancement",null,null,"Completed","2017-05-01",{"$f":"'Version Control'!$C$9","v":"v6.5"}]
[9,"2017-04-24","Mario Lorenzi","Serviceability","Swap columns displaying Existing & New v Rental Income/Rental Income ",null,null,null,null,null,{"$f":"'Version Control'!$C$4","v":"V6.6 Test (v6.43)"},"Enhancement",null,null,"Completed","2017-05-01",{"$f":"'Version Control'!$C$9","v":"v6.5"}]
[10,"2017-04-24","Mario Lorenzi","Tables","Check Monthly Service Fee calculation - to assume entry of Residential Loans only - calculated at $15 per month",null,null,null,null,null,{"$f":"'Version Control'!$C$4","v":"V6.6 Test (v6.43)"},"Bug",null,null,"Completed","2017-05-01",{"$f":"'Version Control'!$C$9","v":"v6.5"}]
[11,"2017-04-24","Mario Lorenzi","Serviceability","Company Income headings realigned to display above the detail line",null,null,null,null,null,{"$f":"'Version Control'!$C$4","v":"V6.6 Test (v6.43)"},"Enhancement",null,null,"Completed","2017-05-01",{"$f":"'Version Control'!$C$9","v":"v6.5"}]
[12,"2017-04-24","Mario Lorenzi","Serviceability","Company Income section moved to display after Rental Income",null,null,null,null,null,{"$f":"'Version Control'!$C$4","v":"V6.6 Test (v6.43)"},"Enhancement",null,null,"Completed","2017-05-01",{"$f":"'Version Control'!$C$9","v":"v6.5"}]
[13,"2017-04-24","Mario Lorenzi","Serviceability","Change Personal Income descriptors from \"Guarantor 1, 2, 3, and 4\" to \"Applicant / Guarantor 1, 2, 3, and 4\"",null,null,null,null,null,{"$f":"'Version Control'!$C$4","v":"V6.6 Test (v6.43)"},"Enhancement",null,null,"Completed","2017-05-01",{"$f":"'Version Control'!$C$9","v":"v6.5"}]
[14,"2017-04-24","Mario Lorenzi","Tables","Tables Sheet - Highlight in yellow those data cells that can be changed to reflect legislation or company policy changes.",null,null,null,null,null,{"$f":"'Version Control'!$C$4","v":"V6.6 Test (v6.43)"},"Enhancement",null,null,"Completed","2017-05-01",{"$f":"'Version Control'!$C$9","v":"v6.5"}]
[15,"2017-06-08","Mario Lorenzi","Tax Calc","Tax Calc Sheet - delete Other Income Cells A10 to I13",null,null,null,null,null,{"$f":"'Version Control'!$C$5","v":"V6.8 Test (v6.44)"},"Enhancement",null,null,"Completed","2017-06-15",{"$f":"'Version Control'!$C$9","v":"v6.5"}]
[16,"2017-06-08","Mario Lorenzi","Tax Calc","Tax Calc Sheet - delete \"Correct Formula For Serviceability - Don’t Think Arm Can Do This\" Cells L1 to R25",null,null,null,null,null,{"$f":"'Version Control'!$C$5","v":"V6.8 Test (v6.44)"},"Enhancement",null,null,"Completed","2017-06-15",{"$f":"'Version Control'!$C$9","v":"v6.5"}]
[17,"2017-06-08","Mario Lorenzi","Serviceability","Fix formatting of Financier Cells for Existing Loans",null,null,null,null,null,{"$f":"'Version Control'!$C$5","v":"V6.8 Test (v6.44)"},"Bug",null,null,"Completed","2017-06-15",{"$f":"'Version Control'!$C$9","v":"v6.5"}]
[18,"2017-06-19","Trevor Smith","User Problems\nVersion Control","Add Sheets for User Problems and Version Control.",null,null,null,null,null,{"$f":"'Version Control'!$C$6","v":"V6.9 (v6.45)"},"Enhancement",null,null,"Completed","2017-06-20",{"$f":"'Version Control'!$C$9","v":"v6.5"}]
[19,"2017-06-19","Angelo Klidomitis","Serviceability","Change Look & Feel as per 4.0 ServiceabilityCalculator.xlsx",null,null,null,null,null,{"$f":"'Version Control'!$C$6","v":"V6.9 (v6.45)"},"Enhancement",null,null,"Completed","2017-06-21",{"$f":"'Version Control'!$C$9","v":"v6.5"}]
[20,"2017-05-22","Mario Lorenzi & Bill Slattery","Serviceability","Increase readability of printed version of the sheet",null,null,null,null,null,{"$f":"'Version Control'!C7","v":"V6.10 (v6.46)"},"Enhancement",null,null,"Completed","2017-06-26",{"$f":"'Version Control'!$C$9","v":"v6.5"}]
[21,"2017-06-29","Mario Lorenzi","Serviceability","1) Borders missing for  Enter Source of Income, Rental Income, Maintenance, & Other Fixed Monthly Repayments.\n2) Enter a zero in each dollar entry cell so the user is aware it is available for entry.",null,null,null,null,null,{"$f":"'Version Control'!C8","v":"v6.47 Pending"},"Enhancement & Bug",null,null,"Completed","2017-06-29",{"$f":"'Version Control'!$C$9","v":"v6.5"}]
[22,"2018-11-20","Lorraine Taylor ","Servicebility","IF more then three adult in one household please display the mssage",null,null,null,null,null,"V7.3",null,null,null,"Completed","2018-11-20","V7.3"]
[23]
[24]
[25]
[26]
[27]
[28]
[29]
[30]
[31]
[32]
[33]

{"sheet":"Version Control","index":6,"n_rows":32,"n_cols":10,"rows_kept":32,"cut":false,"hidden":true,"merged":[]}
["Name","Date","Version #","Development Version File Name","Changes","Released Version",null,"Current Version",{"$f":"VLOOKUP($J$1,B2:$I$3983,8,FALSE)","v":"V10.12 210115"},{"$f":"MAX(B2:B3983)","v":"2021-01-15"}]
["Trevor Smith","2017-04-10","V6.4 Test","K:\\IT\\Change_Work Requests\\Work Request\\WR004 - Commercial Calculator\\02 Residential Calculator\\2017 05 Changes\\4. REDZED-Serviceability-170410-V6.4 Test2.xls","User Problem 1",null,{"$f":"IFERROR(VLOOKUP(MONTH(B2),'Day and Months Table'!A:B,2,FALSE)&VLOOKUP(DAY(B2),'Day and Months Table'!A:B,2,FALSE),\"N/A\")","v":"0410"},{"$f":"RIGHT(YEAR(B2),2)&G2","v":"170410"},{"$f":"CONCATENATE(C2,\" \",H2)","v":"V6.4 Test 170410"}]
["Trevor Smith","2017-04-10","V6.4 Test2  (v6.42)","K:\\IT\\Change_Work Requests\\Work Request\\WR004 - Commercial Calculator\\02 Residential Calculator\\2017 05 Changes\\4. REDZED-Serviceability-170410-V6.4 Test.xls","User Problem 2",null,{"$f":"IFERROR(VLOOKUP(MONTH(B3),'Day and Months Table'!A:B,2,FALSE)&VLOOKUP(DAY(B3),'Day and Months Table'!A:B,2,FALSE),\"N/A\")","v":"0410"},{"$f":"RIGHT(YEAR(B3),2)&G3","v":"170410"},{"$f":"CONCATENATE(C3,\" \",H3)","v":"V6.4 Test2  (v6.42) 170410"}]
["Trevor Smith","2017-05-01","V6.6 Test (v6.43)","K:\\IT\\Change_Work Requests\\Work Request\\WR004 - Commercial Calculator\\02 Residential Calculator\\2017 05 Changes\\4. REDZED-Serviceability-170410-V6.6 Test.xls","User Problems 3 - 14 inclusive",null,{"$f":"IFERROR(VLOOKUP(MONTH(B4),'Day and Months Table'!A:B,2,FALSE)&VLOOKUP(DAY(B4),'Day and Months Table'!A:B,2,FALSE),\"N/A\")","v":"0501"},"170501","V6.6 Test (v6.43) 170501"]
["Trevor Smith","2017-05-15","V6.8 Test (v6.44)","K:\\IT\\Change_Work Requests\\Work Request\\WR004 - Commercial Calculator\\02 Residential Calculator\\2017 05 Changes\\4. REDZED-Serviceability-170410-V6.8 Test.xls","User Problems 15 - 17 inclusive",null,{"$f":"IFERROR(VLOOKUP(MONTH(B5),'Day and Months Table'!A:B,2,FALSE)&VLOOKUP(DAY(B5),'Day and Months Table'!A:B,2,FALSE),\"N/A\")","v":"0515"},"170515","V6.8 Test (v6.44) 170515"]
["Trevor Smith","2017-06-21","V6.9 (v6.45)","K:\\IT\\Change_Work Requests\\Work Request\\WR004 - Commercial Calculator\\02 Residential Calculator\\2017 05 Changes\\4. REDZED-Serviceability-170410-V6.9.xls","User Problem 18 - 19","Issued to Mario Lorenzi for testing 20 June 2017",{"$f":"IFERROR(VLOOKUP(MONTH(B6),'Day and Months Table'!A:B,2,FALSE)&VLOOKUP(DAY(B6),'Day and Months Table'!A:B,2,FALSE),\"N/A\")","v":"0621"},"170621","V6.9 (v6.45) 170621"]
["Trevor Smith","2017-06-27","V6.10 (v6.46)","K:\\IT\\Change_Work Requests\\Work Request\\WR004 - Commercial Calculator\\02 Residential Calculator\\2017 05 Changes\\4. REDZED-Serviceability-170410-V6.10.xls\nA changed versioning system for both this Residential Calculator and the Commercial Calculator was agreed with Tina Georgiadis 26 June 2015 (after receiving feedback from Angel Klidomitis). The last version of the Residential Calculator was named \"4. REDZED-Serviceability-170410-V6.4.xls\". The naming convention is being changed to \"REDZED-Serviceability Type (ie Residential or Commercial) Version Number.xls\". Each release will have a date added as a suffix in the format yymmdd. Because the upcoming release does not contain major ammendments it will be named  \"REDZED-Serviceability Residential v6.5 yymmdd.xls\". This being the case, the naming of the development files should have been as per the bracketed values in the Version # cells (eg 4. REDZED-Serviceability-170410-V6.4 Test.xls should have been 4. REDZED-Serviceability-170410-V6.41.xls)\nTo move to the new numbering system this version was copied and renamed and saved to the new development and release folder structure 26 June 2017. The new location and file name is K:\\Credit\\Servicing Calculator - Residential\\Development - Residential\\REDZED-Serviceability Residential V0.646.xlsm. The released version number for this series of amendments will be v6.5 with a date added in the format yymmdd.","A renamed version + User Problem 20",null,{"$f":"IFERROR(VLOOKUP(MONTH(B7),'Day and Months Table'!A:B,2,FALSE)&VLOOKUP(DAY(B7),'Day and Months Table'!A:B,2,FALSE),\"N/A\")","v":"0627"},"170627","V6.10 (v6.46) 170627"]
["Trevor Smith","2017-06-29","v6.47 Pending","K:\\Credit\\Servicing Calculator - Residential\\Development - Residential\\REDZED-Serviceability Residential V0.647.xlsm","User Problem 21",null,{"$f":"IFERROR(VLOOKUP(MONTH(B8),'Day and Months Table'!A:B,2,FALSE)&VLOOKUP(DAY(B8),'Day and Months Table'!A:B,2,FALSE),\"N/A\")","v":"0629"},"170629","v6.47 Pending 170629"]
["Trevor Smith","2017-06-30","v6.5",null,null,"K:\\Credit\\Servicing Calculator - Residential\\Current Released Version - Residential\\REDZED-Serviceability Residential V6.5.xlsm",{"$f":"IFERROR(VLOOKUP(MONTH(B9),'Day and Months Table'!A:B,2,FALSE)&VLOOKUP(DAY(B9),'Day and Months Table'!A:B,2,FALSE),\"N/A\")","v":"0630"},"170630","v6.5 170630"]
["Mayank Badhen","2018-06-25","V7.1A","Updated the living expense ",null,null,{"$f":"IFERROR(VLOOKUP(MONTH(B10),'Day and Months Table'!A:B,2,FALSE)&VLOOKUP(DAY(B10),'Day and Months Table'!A:B,2,FALSE),\"N/A\")","v":"0625"},"180625","V7.1A 180625"]
["Mayank Badhen","2018-07-25","V7.2","updated living expense for Company\nselecting household is mandatory\nupdated the tax scale\ncompnay income is always attached to household 1",null,null,{"$f":"IFERROR(VLOOKUP(MONTH(B11),'Day and Months Table'!A:B,2,FALSE)&VLOOKUP(DAY(B11),'Day and Months Table'!A:B,2,FALSE),\"N/A\")","v":"0725"},"180725","V7.2 180725"]
["Mayank Badhen","2018-12-11","V7.2.1","IF more then three adult in one household please display the mssage",null,null,{"$f":"IFERROR(VLOOKUP(MONTH(B12),'Day and Months Table'!A:B,2,FALSE)&VLOOKUP(DAY(B12),'Day and Months Table'!A:B,2,FALSE),\"N/A\")","v":"1211"},"181211","V7.2.1 181211"]
["Mayank Badhen","2019-06-26","V7.3","credit card obligations",null,null,{"$f":"IFERROR(VLOOKUP(MONTH(B13),'Day and Months Table'!A:B,2,FALSE)&VLOOKUP(DAY(B13),'Day and Months Table'!A:B,2,FALSE),\"N/A\")","v":"0626"},"190626","V7.3 190626"]
["Mayank Badhen","2019-12-02","V7.4","IO term fixed",null,null,{"$f":"IFERROR(VLOOKUP(MONTH(B14),'Day and Months Table'!A:B,2,FALSE)&VLOOKUP(DAY(B14),'Day and Months Table'!A:B,2,FALSE),\"N/A\")","v":"1202"},"191202","V7.4 191202"]
[null,null,null,null,null,null,{"$f":"IFERROR(VLOOKUP(MONTH(B15),'Day and Months Table'!A:B,2,FALSE)&VLOOKUP(DAY(B15),'Day and Months Table'!A:B,2,FALSE),\"N/A\")","v":"N/A"},"00N/A"," 00N/A"]
[null,null,null,null,null,null,{"$f":"IFERROR(VLOOKUP(MONTH(B16),'Day and Months Table'!A:B,2,FALSE)&VLOOKUP(DAY(B16),'Day and Months Table'!A:B,2,FALSE),\"N/A\")","v":"N/A"},"00N/A"," 00N/A"]
[null,null,null,null,null,null,{"$f":"IFERROR(VLOOKUP(MONTH(B17),'Day and Months Table'!A:B,2,FALSE)&VLOOKUP(DAY(B17),'Day and Months Table'!A:B,2,FALSE),\"N/A\")","v":"N/A"},"00N/A"," 00N/A"]
["John Jiang","2020-07-30","V10.0","1. Residential calculator \na. Introduction of a traffic light Pass, Refer to RZ or Fail notification. Pass >1.10, Refer >1.05 – 1.10, Fail below 1.05. The introduction of the Refer category is designed to encourage brokers to Refer deals where we don’t quite meet servicing requirements, but in discussion with RZ we may jointly find a way forward. Potentially these deals may be currently being sent to other lenders who have lower servicing ratio benchmarks). \nb. Creating a blank template.\nc. Removal of the tax calculation for company income to fall in line with the policy which states that we assess on NPBT.\n \nOther general changes including ensuring;\n1. Living expenses were consistent across all selections (there were some errors & inconsistencies)\n2. Tax scales were checked and amended for consistency.\n",null,null,{"$f":"IFERROR(VLOOKUP(MONTH(B18),'Day and Months Table'!A:B,2,FALSE)&VLOOKUP(DAY(B18),'Day and Months Table'!A:B,2,FALSE),\"N/A\")","v":"0730"},"200730","V10.0 200730"]
["John Jiang","2020-08-13","V10.0 Residential","Changed footer",null,null,{"$f":"IFERROR(VLOOKUP(MONTH(B19),'Day and Months Table'!A:B,2,FALSE)&VLOOKUP(DAY(B19),'Day and Months Table'!A:B,2,FALSE),\"N/A\")","v":"0813"},"200813","V10.0 Residential 200813"]
["John Jiang","2020-11-16","V10.1","changed tax bracket to new 2020 tax regulation",null,null,{"$f":"IFERROR(VLOOKUP(MONTH(B20),'Day and Months Table'!A:B,2,FALSE)&VLOOKUP(DAY(B20),'Day and Months Table'!A:B,2,FALSE),\"N/A\")","v":"1116"},"201116","V10.1 201116"]
["John Jiang","2020-12-17","V10.11","change interest floor rate from 7% to 6%",null,null,{"$f":"IFERROR(VLOOKUP(MONTH(B21),'Day and Months Table'!A:B,2,FALSE)&VLOOKUP(DAY(B21),'Day and Months Table'!A:B,2,FALSE),\"N/A\")","v":"1217"},"201217","V10.11 201217"]
["John Jiang","2021-01-15","V10.12","Update HEM table according to Sept 2020 quarter data from HEM",null,null,{"$f":"IFERROR(VLOOKUP(MONTH(B22),'Day and Months Table'!A:B,2,FALSE)&VLOOKUP(DAY(B22),'Day and Months Table'!A:B,2,FALSE),\"N/A\")","v":"0115"},"210115","V10.12 210115"]
[null,null,null,null,null,null,{"$f":"IFERROR(VLOOKUP(MONTH(B23),'Day and Months Table'!A:B,2,FALSE)&VLOOKUP(DAY(B23),'Day and Months Table'!A:B,2,FALSE),\"N/A\")","v":"N/A"},"00N/A"," 00N/A"]
[null,null,null,null,null,null,{"$f":"IFERROR(VLOOKUP(MONTH(B24),'Day and Months Table'!A:B,2,FALSE)&VLOOKUP(DAY(B24),'Day and Months Table'!A:B,2,FALSE),\"N/A\")","v":"N/A"},"00N/A"," 00N/A"]
[null,null,null,null,null,null,{"$f":"IFERROR(VLOOKUP(MONTH(B25),'Day and Months Table'!A:B,2,FALSE)&VLOOKUP(DAY(B25),'Day and Months Table'!A:B,2,FALSE),\"N/A\")","v":"N/A"},"00N/A"," 00N/A"]
[null,null,null,null,null,null,{"$f":"IFERROR(VLOOKUP(MONTH(B26),'Day and Months Table'!A:B,2,FALSE)&VLOOKUP(DAY(B26),'Day and Months Table'!A:B,2,FALSE),\"N/A\")","v":"N/A"},"00N/A"," 00N/A"]
[null,null,null,null,null,null,{"$f":"IFERROR(VLOOKUP(MONTH(B27),'Day and Months Table'!A:B,2,FALSE)&VLOOKUP(DAY(B27),'Day and Months Table'!A:B,2,FALSE),\"N/A\")","v":"N/A"},"00N/A"," 00N/A"]
[null,null,null,null,null,null,{"$f":"IFERROR(VLOOKUP(MONTH(B28),'Day and Months Table'!A:B,2,FALSE)&VLOOKUP(DAY(B28),'Day and Months Table'!A:B,2,FALSE),\"N/A\")","v":"N/A"},"00N/A"," 00N/A"]
[null,null,null,null,null,null,{"$f":"IFERROR(VLOOKUP(MONTH(B29),'Day and Months Table'!A:B,2,FALSE)&VLOOKUP(DAY(B29),'Day and Months Table'!A:B,2,FALSE),\"N/A\")","v":"N/A"},"00N/A"," 00N/A"]
[null,null,null,null,null,null,{"$f":"IFERROR(VLOOKUP(MONTH(B30),'Day and Months Table'!A:B,2,FALSE)&VLOOKUP(DAY(B30),'Day and Months Table'!A:B,2,FALSE),\"N/A\")","v":"N/A"},"00N/A"," 00N/A"]
[null,null,null,null,null,null,{"$f":"IFERROR(VLOOKUP(MONTH(B31),'Day and Months Table'!A:B,2,FALSE)&VLOOKUP(DAY(B31),'Day and Months Table'!A:B,2,FALSE),\"N/A\")","v":"N/A"},"00N/A"," 00N/A"]
[null,null,null,null,null,null,{"$f":"IFERROR(VLOOKUP(MONTH(B32),'Day and Months Table'!A:B,2,FALSE)&VLOOKUP(DAY(B32),'Day and Months Table'!A:B,2,FALSE),\"N/A\")","v":"N/A"},"00N/A"," 00N/A"]

{"sheet":"Day and Months Table","index":7,"n_rows":31,"n_cols":2,"rows_kept":31,"cut":false,"hidden":true,"merged":[]}
[1,"01"]
[2,"02"]
[3,"03"]
[4,"04"]
[5,"05"]
[6,"06"]
[7,"07"]
[8,"08"]
[9,"09"]
[10,"10"]
[11,"11"]
[12,"12"]
[13,"13"]
[14,"14"]
[15,"15"]
[16,"16"]
[17,"17"]
[18,"18"]
[19,"19"]
[20,"20"]
[21,"21"]
[22,"22"]
[23,"23"]
[24,"24"]
[25,"25"]
[26,"26"]
[27,"27"]
[28,"28"]
[29,"29"]
[30,"30"]
[31,"31"]