{"text_format":"1","workbook":"xlsx","n_sheets":8,"sheets":["Change Log","Calculator","Rental Income","Negative Gearing","Commitments","NIS","Parameters","HEM"],"not_rendered":{"charts":0,"images":1,"macros":1,"external_links":0,"defined_names":22,"comments":1,"pivot_tables":0},"unopened":[],"bounds":{"document_bytes":16777216,"sheet_cells":100000,"rows_first":2000,"rows_last":500,"rows_between":2000,"halvings":0,"cell_chars":16384,"cell_head_chars":4096},"cells_cut":0,"cells_raw":0,"read":"whole","date_system":"1900"}

{"sheet":"Change Log","index":0,"n_rows":16,"n_cols":6,"rows_kept":16,"cut":false,"hidden":true,"merged":[]}
["Version","Date","Description","Preparer","Authoriser","Sign-Off"]
[4,"2018-03-01","1. Model output changed from NSR / DSR to NIS\n2. NIS figure hidden from user with Pass / Fail outcome displayed and Green / Red colouring\n3. Maximum Loan Amount formula updated to use NIS\n4. Updated drop down options for Residential Status of Applicants to align with application form\n5. Added Application Status field\n6. Added Application Last Updated field\n7. Added CCAS ID field\n8. Added Interest Only Term field with drop down options from 0 to 5 years\n9. Income fields expanded to capture a  wider number of categories (Rental Income Distribution macro removed accordingly)\n10. Income category haircut parameters included with automatic calculation of haircuts\n11. Medicare Levy Surcharge is now included in assessment\n12. Declared Expenses fields expanded to capture a wider number of categories\n13. Displays relevant HEM for greater transparency in comparison against Declared Expenses\n14. Maximum number of existing mortgages that can be assessed increased from 1 to 3\n15. Overdraft accounts can now be assessed\n16. HEM data now stored in database format to utilise output of HEM data cleaning tool\n17. HEM data lookup formula no longer requires updating of income band parameters\n18. HEM data updated to 2017 Q4","KPMG"]
[4.0999999999999996,"2011-09-01","1. HEM data updated to 2018 Q1\n2. Tax data updated to 2018-2019"]
["5.2 (5.0&5.1 Obsolete)","2019-08-07","1. Updated HEM data to Q1 2019\n2. Updated Floor Rate to 5.75%\n3. Updated Buffer Rate to 2.5%\n4. Credit Commitment Section - Assessment Rate made available for edit to accomendate the change of floor and buffer rate","William Wang PBD\nValidated by DDT Team"]
[null,"2020-04-02","1. Added Income repayment frequency category\n2. Added additional pages for rental income and negative gearing input\n3. Added a column to display the effects of haircuts on income\n4. Added calculations for negative gearing, postcode, rental yield, frequency and ownership percentage\n5. Added logic for high density/risk property rental income shading\n6. Enhanced HEM Look-up and calculation flexibility for source data structure changes\n7. Implemented extrapolation for HEM where dependents are greater than 3\n8. Added HEM/declared repayments indicator\n9. Added HECS bands and HECS repayments\n10. Updated HEM income bands to include all income categories\n11. Implemented dynamic applicant marriage status fields\n12. Added granular commitment breakdowns (assessment rate/term/limit/declared repayments)\n13. Implemented additional commitments such as Line of Credit, Equity Loans and Commercial Loans.\n14. Implemented dropdown list commitment selector\n15. Removed limit on number of commitments that can be added\n16. Implemented DTI and LTI output\n17. HEM data updated to Q4 2019\n18. Updated Floor rate to 5.50%","KPMG\nVallidated by 2 rounds of internal testing and Model Validation by KPMG"]
[null,"2020-05-28","1. Fixed Formular Bug for \"Taxable Income Haircut\" do not recognise High Density Property Rental haircut 30%;\n2. Fixed Formular Bug for \"DTI\" & \"LTI\" not including \"Non-Taxable Income\" in calculation;","KPMG\nValidated by William Wang PBD"]
[null,"2020-06-19","1. Negative input controls implemented for Commitments\n2. Negative input controls implemented for Rental Income Ownership Percentage\n3. Negative input controls implemented for Negative Gearing Ownership Percentage, Outstanding Balance, Interest Rate\n4. Removed cap on number of income bands that can be accepted when updating HEM","KPMG"]
[null,"2020-06-24","1. Improved user experience for selected Commitments allowing either limit/term/interest inputs or declared repayment input or both\n2. Combined Line of Credit and Overdraft categories in commitments and aligned calculation methodology to Credit Cards\n3. Verified Commitment calculation for Commercial Loans","KPMG"]
[null,"2020-06-25","1. Renamed \"Taxable Income after Haircuts / Deductions\" to \"Taxable Income\"","KPMG"]
[null,"2020-07-17","1 Adjust DTI Parameters to display RED when DTI above 6 times, and Amber when DTI above 5.5 times","William Wang PBD"]
{"$rows_left_out":7}
{"sheet":"Calculator","index":1,"n_rows":150,"n_cols":31,"rows_kept":150,"cut":false,"hidden":false,"merged":[[149,2,151,12],[131,14,132,14],[2,4,4,12],[88,14,89,14],[5,4,5,12],[57,14,58,14],[36,14,37,14]]}
[]
[]
[null,null,"Bank of China (Australia) Limited",null,"APPROVED"]
[null,null,null,null,null,null,null,null,null,null,null,null,null,null,null,null,null,null,null,null,null,"Status",null,null,null,null,"Applicant 1","Applicant 2","Applicant 3","Applicant 4","Index"]
[null,null,"Loan Serviceability Calculator",null,null,null,null,null,null,null,null,null,null,null,null,null,null,null,null,null,null,"Couple","Single","Applicant 1",null,{"$f":"IF(AND($M$11=\"\", $M$12=\"\", $M$13=\"\", $M$14=\"\"),1,0)","v":1},null,null,null,null,{"$f":"SUM(Z5:Z20)","v":1}]
[null,null,"Version 6.2.9",null,{"$f":"\"Application last updated \"&TEXT(LastSavedTimeStamp(),\"dd/mm/yyyy\")","v":"Application last updated 20/06/2024"},null,null,null,null,null,null,null,null,null,null,null,null,null,null,null,null,{"$f":"IF($L$11=\"Couple\", IF(COUNTIF($M$11:$M$14, $X5) > 0, INDEX($K$11:$K$14, MATCH($X5, $M$11:$M$14, 0)), IF(OR(CC=1, CC=2, CC=3, CC=5, CC=6, CC=8, CC=10, CC=13), \"Applicant 2\", IF(OR(CC=4, CC=7, CC=11, CC=14), \"Applicant 3\", IF(OR(CC=9, CC=15), \"Applicant 4\", \"\")))), \"\")","v":""},null,null,null,{"$f":"IF(AND($M$11=\"\", $M$12=\"\", $M$13=\"\", $M$14<>\"\"),2, 0)","v":0}]
[null,null,null,null,null,null,null,null,null,null,null,null,null,null,null,null,null,null,null,null,null,{"$f":"IF($L$11=\"Couple\", IF(COUNTIF($M$11:$M$14,$X5) > 0, \"\", IF(OR(CC=1, CC=2, CC=5, CC=8), \"Applicant 3\", IF(OR(CC=3, CC=4, CC = 10, CC=11), \"Applicant 4\", \"\"))),\"\")","v":""},null,null,null,{"$f":"IF(AND($M$11=\"\", $M$12=\"\", $M$13<>\"\", $M$14=\"\"),3,0)","v":0}]
[null,null,"Applicant Details",null,null,null,null,null,null,null,null,null,null,null,null,null,null,null,null,null,null,{"$f":"IF($L$11=\"Couple\", IF(COUNTIF($M$11:$M$14,$X5) > 0, \"\", IF(OR(CC=1, CC=5), \"Applicant 4\", \"\")), \"\")","v":""},null,null,null,{"$f":"IF(AND($M$11=\"\", $M$12<>\"\", $M$13=\"\", $M$14=\"\"),4,0)","v":0}]
[null,null,null,null,null,null,null,null,null,null,null,null,null,null,null,null,null,null,null,null,null,"Couple","Single","Applicant 2",null,{"$f":"IF(AND($M$11<>\"\", $M$12=\"\", $M$13=\"\", $M$14=\"\"),5,0)","v":0}]
[null,null,"CCAS ID",null,null,null,null,null,null,null,null,"Status","Married to",null,"Number of Dependents",null,"Living Location",null,null,null,null,{"$f":"IF($L$12=\"Couple\", IF(COUNTIF($M$11:$M$14, $X9) > 0, INDEX($K$11:$K$14, MATCH($X9, $M$11:$M$14, 0)), IF(OR(CC=1, CC=2, CC=3, CC=4, CC=6, CC=7, CC=9, CC=12), \"Applicant 1\", IF(OR(CC=5, CC=8, CC=11, CC=14), \"Applicant 3\", IF(OR(CC=10, CC=15), \"Applicant 4\", \"\")))), \"\")","v":""},null,null,null,{"$f":"IF(AND($M$11=\"\", $M$12=\"\", $M$13<>\"\", $M$14<>\"\"),6,0)","v":0}]
{"$rows_left_out":141}
{"sheet":"Rental Income","index":2,"n_rows":104,"n_cols":25,"rows_kept":104,"cut":false,"hidden":false,"merged":[[5,5,5,9],[62,4,62,7],[2,3,4,6]]}
[]
[]
[null,null,"Bank of China (Australia) Limited","Rental Income Calculator"]
[]
[null,null,"Loan Serviceability Calculator"]
[null,null,{"$f":"Calculator!C6","v":"Version 6.2.9"}]
[]
[null,null,"Property Details"]
[]
[null,null,"Property Address","Postcode","State","More than 35 units","High Density","Declared Rent","Frequency","Eligible Rental Income",null,null,null,null,"State List",null,"Cycle","Pays","Rent Calculation"]
{"$rows_left_out":95}
{"sheet":"Negative Gearing","index":3,"n_rows":27,"n_cols":19,"rows_kept":27,"cut":false,"hidden":false,"merged":[[5,7,5,9],[9,6,9,9],[2,4,4,6]]}
[]
[]
[null,null,"Bank of China (Australia) Limited",null,"Negative Gearing Calculator"]
[]
[null,null,"Loan Serviceability Calculator"]
[null,null,{"$f":"Calculator!C6","v":"Version 6.2.9"}]
[]
[null,null,"Negative Gearing Details"]
[]
[null,null,null,null,null,null,"Percentage of Ownership"]
{"$rows_left_out":18}
{"sheet":"Commitments","index":4,"n_rows":327,"n_cols":44,"rows_kept":327,"cut":false,"hidden":true,"merged":[]}
[]
[]
[]
[null,null,"Product Type",null,"Index","Commitment Matrix",null,"Subtotal"]
[null,null,"-",null,1,{"$f":"Calculator!$C96","v":"-"},"Existing Mortgage",{"$f":"IF(F5=G5,-PMT(IF(Calculator!I96<>0, MAX(Calculator!I96+Interest_Rate_Buffer,Interest_Rate_Floor)/12, (Interest_Rate_Floor/12)),Calculator!G96,Calculator!E96,0,0),0)","v":0},"Index"]
[null,null,"Existing Mortgage",null,2,{"$f":"Calculator!$C97","v":"-"},"Existing Mortgage",{"$f":"IF(F6=G6,-PMT(IF(Calculator!I97<>0, MAX(Calculator!I97+Interest_Rate_Buffer,Interest_Rate_Floor)/12, (Interest_Rate_Floor/12)),Calculator!G97,Calculator!E97,0,0),0)","v":0},"Existing Mortgage",{"$f":"TRANSPOSE(H5:H39)","v":0},0,0,0,0,0,0,0,0,0,0,0,0,0,0,0,0,0,0,0,0,0,0,0,0,0,0,0,0,0,0,0,0,0,0]
[null,null,"Personal Loan",null,3,{"$f":"Calculator!$C98","v":"-"},"Existing Mortgage",{"$f":"IF(F7=G7,-PMT(IF(Calculator!I98<>0, MAX(Calculator!I98+Interest_Rate_Buffer,Interest_Rate_Floor)/12, (Interest_Rate_Floor/12)),Calculator!G98,Calculator!E98,0,0),0)","v":0},"Personal Loan",{"$f":"TRANSPOSE(H41:H75)","v":0},0,0,0,0,0,0,0,0,0,0,0,0,0,0,0,0,0,0,0,0,0,0,0,0,0,0,0,0,0,0,0,0,0,0]
[null,null,"Line of Credit and Overdraft",null,4,{"$f":"Calculator!$C99","v":"-"},"Existing Mortgage",{"$f":"IF(F8=G8,-PMT(IF(Calculator!I99<>0, MAX(Calculator!I99+Interest_Rate_Buffer,Interest_Rate_Floor)/12, (Interest_Rate_Floor/12)),Calculator!G99,Calculator!E99,0,0),0)","v":0},"Overdraft",{"$f":"TRANSPOSE(H77:H111)","v":0},0,0,0,0,0,0,0,0,0,0,0,0,0,0,0,0,0,0,0,0,0,0,0,0,0,0,0,0,0,0,0,0,0,0]
[null,null,"Credit Card",null,5,{"$f":"Calculator!$C100","v":"-"},"Existing Mortgage",{"$f":"IF(F9=G9,-PMT(IF(Calculator!I100<>0, MAX(Calculator!I100+Interest_Rate_Buffer,Interest_Rate_Floor)/12, (Interest_Rate_Floor/12)),Calculator!G100,Calculator!E100,0,0),0)","v":0},"Credit Card",{"$f":"TRANSPOSE(H113:H147)","v":0},0,0,0,0,0,0,0,0,0,0,0,0,0,0,0,0,0,0,0,0,0,0,0,0,0,0,0,0,0,0,0,0,0,0]
[null,null,"Tax Obligations",null,6,{"$f":"Calculator!$C101","v":"-"},"Existing Mortgage",{"$f":"IF(F10=G10,-PMT(IF(Calculator!I101<>0, MAX(Calculator!I101+Interest_Rate_Buffer,Interest_Rate_Floor)/12, (Interest_Rate_Floor/12)),Calculator!G101,Calculator!E101,0,0),0)","v":0},"Tax Obligations",{"$f":"TRANSPOSE(H149:H183)","v":0},0,0,0,0,0,0,0,0,0,0,0,0,0,0,0,0,0,0,0,0,0,0,0,0,0,0,0,0,0,0,0,0,0,0]
{"$rows_left_out":318}
{"sheet":"NIS","index":5,"n_rows":11,"n_cols":7,"rows_kept":11,"cut":false,"hidden":false,"merged":[]}
[]
[]
[null,null,"Serviceability Assessment"]
[]
[null,null,"Total Monthly Net Income",null,null,null,{"$f":"Calculator!$O$60","v":0}]
[null,null,"Total Monthly Expenses",null,null,null,{"$f":"Calculator!$O$91","v":0}]
[null,null,"Total Monthly Credit Commitments",null,null,null,{"$f":"Calculator!$O$134","v":0}]
[]
[null,null,"Net Income Surplus",null,null,null,{"$f":"$G$5-$G$6-$G$7","v":0}]
[]
{"$rows_left_out":2}
{"sheet":"Parameters","index":6,"n_rows":40,"n_cols":41,"rows_kept":40,"cut":false,"hidden":true,"merged":[]}
["Application Status","Loan Purpose","Residential Status","Interest Only Term","Living Location","Tax Upper Income Threshold","Base Tax","Marginal Tax Rate","Medicare Levy","MLS Upper Single Income Threshold","MLS Upper Family Income Threshold","Medicare Levy Surcharge","Binary","NIS Buffer","Payment on Overdraft Limit","Payment on Credit Card Limit","Interest Rate Buffer","Interest Rate Floor","Commercial Buffer","Other Commitment Buffer","Living Expense Buffer","Notional Rental Individual","Notional Rental Couple","Overtime Income Haircut","Commission Income Haircut","Bonus (Irregular) Income Haircut","Rental Income Haircut","High Density Rental Income Haircut","High Risk Postcodes","High Risk States","Dividend Income Haircut","Interest Income Haircut","Trust Deed Income Haircut","Managed Fund Income Haircut","Foreign Income Haircut","Maintenance Income Haircut","Government Payments Income Haircut","HECS Band Threshold","HECS Repayment Rate","DTI","DTI Color Code"]
["DRAFT","Owner occupied","Owner no mortgage",0,"Australia",18200,0,0,0.02,0,0,0,"Yes",100,3.7999999999999999E-2,3.7999999999999999E-2,0.03,5.2999999999999999E-2,0,0,0,150,180,0.2,0.2,0.2,0.2,0.3,2000,"QLD",0.2,0.2,0.2,0.2,0.2,0,0,0,0,6,"Green"]
["APPROVED","Investment","Owner with mortgage",1,"Sydney",45000,0,0.16,null,90000,180000,0.01,"No",null,null,null,null,null,null,null,null,null,null,null,null,null,null,null,2001,null,null,null,null,null,null,null,null,51550,0.01,6.5,"Amber"]
["DECLINED",null,"Boarding",2,"Balance of NSW",135000,4288,0.3,null,105000,210000,1.2500000000000001E-2,null,null,null,null,null,null,null,null,null,null,null,null,null,null,null,null,2002,null,null,null,null,null,null,null,null,59519,0.02,">7","Red"]
["TEST",null,"Renting",3,"Melbourne",190000,31288,0.37,null,140000,280000,1.4999999999999999E-2,null,null,null,null,null,null,null,null,null,null,null,null,null,null,null,null,2003,null,null,null,null,null,null,null,null,63090,2.5000000000000001E-2]
[null,null,"Live with parents/relatives",4,"Balance of VIC",{"$f":"1000000000","v":1000000000},51638,0.45,null,null,null,null,null,null,null,null,null,null,null,null,null,null,null,null,null,null,null,null,2004,null,null,null,null,null,null,null,null,66876,0.03]
[null,null,"Supplied by employer",5,"Brisbane",null,null,null,null,null,null,null,null,null,null,null,null,null,null,null,null,null,null,null,null,null,null,null,2005,null,null,null,null,null,null,null,null,70889,3.5000000000000003E-2]
[null,null,null,null,"Balance of QLD",null,null,null,null,null,null,null,null,null,null,null,null,null,null,null,null,null,null,null,null,null,null,null,2006,null,null,null,null,null,null,null,null,75141,0.04]
[null,null,null,null,"Adelaide",null,null,null,null,null,null,null,null,null,null,null,null,null,null,null,null,null,null,null,null,null,null,null,2007,null,null,null,null,null,null,null,null,79650,4.4999999999999998E-2]
[null,null,null,null,"Balance of SA",null,null,null,null,null,null,null,null,null,null,null,null,null,null,null,null,null,null,null,null,null,null,null,2008,null,null,null,null,null,null,null,null,84430,0.05]
{"$rows_left_out":31}
{"sheet":"HEM","index":7,"n_rows":1681,"n_cols":47,"rows_kept":1681,"cut":false,"hidden":true,"merged":[]}
["Location","Status","Income","HEM","HEM Lookup","Applicant Details","Dependent Index","Dependents",null,"Income Band","Index","Number Index",null,"Applicant 1",null,null,"Dependent Expense Addition","Index Size","Index",3,{"$f":"T1+4","v":7},{"$f":"U1+4","v":11},15,19,23,27,31,35,39,43,47,51,55,59,63,67,71,75,79,83,87,91,95,99,103,107,111]
["Australia","Couple",25000,0,{"$f":"VLOOKUP(C2, $J$2:$K$100, 2)","v":"A"},{"$f":"A2&\"_\"&LEFT(B2, 6)&\"_\"&H2&\"_\"&E2","v":"Australia_Couple_0_A"},{"$f":"MIN(IF(ISNUMBER(FIND({1,2,3,4,5,6,7,8,9,0},B2)),FIND({1,2,3,4,5,6,7,8,9,0},B2)))","v":0},{"$f":"IF(RIGHT(LEFT(B2, G2), 1)=\"\", 0, RIGHT(LEFT(B2, G2), 1))","v":0},null,25000,"A",0,null,"Location",{"$f":"Calculator!Q11","v":0},null,null,{"$f":"COUNTA(K2:K100)","v":15},"Country_Status","Australia_Couple","Australia_Single","Sydney_Couple","Sydney_Single","Balance of NSW_Couple","Balance of NSW_Single","Melbourne_Couple","Melbourne_Single","Balance of VIC_Couple","Balance of VIC_Single","Brisbane_Couple","Brisbane_Single","Balance of QLD_Couple","Balance of QLD_Single","Adelaide_Couple","Adelaide_Single","Balance of SA_Couple","Balance of SA_Single","Perth_Couple","Perth_Single","Balance of WA_Couple","Balance of WA_Single","Hobart_Couple","Hobart_Single","Balance of TAS_Couple","Balance of TAS_Single","ACT & NT_Couple","ACT & NT_Single"]
["Australia","Couple",38000,2526.3549187816966,{"$f":"VLOOKUP(C3, $J$2:$K$100, 2)","v":"B"},{"$f":"A3&\"_\"&LEFT(B3, 6)&\"_\"&H3&\"_\"&E3","v":"Australia_Couple_0_B"},{"$f":"MIN(IF(ISNUMBER(FIND({1,2,3,4,5,6,7,8,9,0},B3)),FIND({1,2,3,4,5,6,7,8,9,0},B3)))","v":0},{"$f":"IF(RIGHT(LEFT(B3, G3), 1)=\"\", 0, RIGHT(LEFT(B3, G3), 1))","v":0},null,38000,"B",1,null,"Marriage Status",{"$f":"Calculator!L11","v":0},null,{"$f":"O2&\"_\"&O3","v":"0_0"},{"$f":"IF(L2<>\"\", L2, \"\")","v":0},{"$f":"IF(K2<>\"\", K2, \"\")","v":"A"},{"$f":"IF($R3<>\"\", OFFSET($D$1, 1+$R$2*(T$1)+$R3, 0) - OFFSET($D$1, 1+$R$2*(T$1-1)+$R3, 0), \"\")","v":0},0,0,0,0,0,0,0,0,0,{"$f":"IF($R3<>\"\", OFFSET($D$1, 1+$R$2*(AD$1)+$R3, 0) - OFFSET($D$1, 1+$R$2*(AD$1-1)+$R3, 0), \"\")","v":0},0,0,0,0,0,0,0,0,0,{"$f":"IF($R3<>\"\", OFFSET($D$1, 1+$R$2*(AN$1)+$R3, 0) - OFFSET($D$1, 1+$R$2*(AN$1-1)+$R3, 0), \"\")","v":0},0,0,0,0,0,0,0]
["Australia","Couple",50000,2599.2465057471277,"C","Australia_Couple_0_C",{"$f":"MIN(IF(ISNUMBER(FIND({1,2,3,4,5,6,7,8,9,0},B4)),FIND({1,2,3,4,5,6,7,8,9,0},B4)))","v":0},0,null,50000,"C",2,null,"Dependents",{"$f":"Calculator!O11","v":0},null,{"$f":"O4-3","v":-3},1,"B",0,-2291.1278790236843,0,-2231.2185300508672,0,-2334.9814183515768,0,-2294.4788973363466,0,-2460.0214079185248,0,-2171.6622512660374,0,-2434.2807342166443,0,-2379.4933696079029,0,-2182.0227335573049,0,-2051.0122761744037,0,-2292.3530963476251,0,-2391.5173286737686,0,-2365.0811833077169,0,-2392.0990943305637]
["Australia","Couple",63000,2700.8712387234705,"D","Australia_Couple_0_D",{"$f":"MIN(IF(ISNUMBER(FIND({1,2,3,4,5,6,7,8,9,0},B5)),FIND({1,2,3,4,5,6,7,8,9,0},B5)))","v":0},0,null,63000,"D",3,null,"Gross Income",{"$f":"IF(AND(Calculator!L11=\"Couple\", Calculator!M11=\"\"), Calculator!E37/Calculator!E81, Calculator!Y59)","v":0},null,{"$f":"VLOOKUP(O6, $S$2:$AU$72, MATCH(Q3, $S$2:$AU$2, 0),0)","v":{"$error":"#N/A"}},2,"C",-3287.0708282660403,477.87825015411318,-3236.130356314176,473.48311504938829,-3339.7925658950121,473.66396847431906,-3299.329245820747,473.59325457335126,-3464.7110389238296,473.88174673425237,-3176.6319555957707,473.3793114512614,-3438.9953805595892,473.83704218692719,-3384.2614197602506,473.74155084594804,-3186.9825296244449,473.39740956840024,-3056.0991906632771,473.16894446762853,-3297.2055107309247,473.58966952325864,-3396.2735334094982,473.7623475700143,-3369.8630792553336,473.71643120009276,-3396.8545333491688,473.7633615582904]
["Australia","Couple",75000,2863.4994252673928,"E","Australia_Couple_0_E",{"$f":"MIN(IF(ISNUMBER(FIND({1,2,3,4,5,6,7,8,9,0},B6)),FIND({1,2,3,4,5,6,7,8,9,0},B6)))","v":0},0,null,75000,"E",4,null,"Gross Income Index",{"$f":"IF(O5<$J$2, $K$2, INDEX($K$2:INDIRECT(\"K\"&(R2+1)), MATCH(O5, $J$2:INDIRECT(\"J\"&(R2+1)))+1))","v":"A"},null,null,3,"D",268.28433225782101,478.05550991790506,282.59037882319853,473.660535244936,282.26509616698741,473.84142877780596,282.39205001198343,473.77079488299705,281.87352029179237,474.0593671898705,282.77717650045952,473.5567316468082,281.95384443318653,474.01450249041318,282.12557383677404,473.91885071767774,282.74454162431539,473.57462929415806,283.15519180438923,473.34632441542453,282.39911373114865,473.76692928704961,282.08820502466142,473.93996802563288,282.17106847165269,473.89369096388327,282.08614145514593,473.94098201390898]
["Australia","Couple",100000,3141.6735942918494,"F","Australia_Couple_0_F",{"$f":"MIN(IF(ISNUMBER(FIND({1,2,3,4,5,6,7,8,9,0},B7)),FIND({1,2,3,4,5,6,7,8,9,0},B7)))","v":0},0,null,100000,"F",5,null,"Applicant Details",{"$f":"IF(O4>3, O2&\"_\"&O3&\"_\"&\"3\"&\"_\"&O6, O2&\"_\"&O3&\"_\"&O4&\"_\"&O6)","v":"0_0_0_A"},null,"HEM Apportioning",4,"E",267.77401397425592,478.33943166838844,282.08006053963254,473.94449710335903,281.75481795238375,474.12531049025711,281.88185168386826,474.0547166334818,281.36256191058555,474.3432489023221,282.26641846405892,473.84069350523123,281.44356621858151,474.29838420286433,281.61529562216947,474.20273243012889,282.23434329620022,473.85855104464281,282.64479325718321,473.63020612787568,281.88819541890416,474.0508510375339,281.57728671241603,474.22384973808403,281.6601501594082,474.17765282230721,281.57578310262033,474.22490383429931]
["Australia","Couple",125000,3502.7541338610718,"G","Australia_Couple_0_G",{"$f":"MIN(IF(ISNUMBER(FIND({1,2,3,4,5,6,7,8,9,0},B8)),FIND({1,2,3,4,5,6,7,8,9,0},B8)))","v":0},0,null,125000,"G",6,null,"HEM",{"$f":"IF(O4>3, INDEX($D:$D, MATCH(O7,$F:$F, 0))+Q4*Q5, INDEX($D:$D, MATCH(O7,$F:$F, 0)))","v":{"$error":"#N/A"}},null,{"$f":"O8*Calculator!E81","v":{"$error":"#N/A"}},5,"F",266.90072003888417,478.82527792563997,281.20644605256939,474.43010271297499,280.88112332739775,474.61091609987216,281.00839772408563,474.54020219890481,280.48918808872759,474.82873446774556,281.39344407463796,474.32629911484855,280.56987159359687,474.78402992041993,280.74160099718392,474.68849847150113,281.36088933641804,474.34439730189342,281.77121909051721,474.11601227718711,281.01506100507368,474.53669729478543,280.70391263912188,474.70929519556876,280.78717576998724,474.66341886367945,280.70240928076055,474.71034929178404]
["Australia","Couple",150000,3804.1680112208683,"H","Australia_Couple_0_H",{"$f":"MIN(IF(ISNUMBER(FIND({1,2,3,4,5,6,7,8,9,0},B9)),FIND({1,2,3,4,5,6,7,8,9,0},B9)))","v":0},0,null,150000,"H",7,null,null,null,null,null,6,"G",265.76672674710699,479.4555044628064,280.07277331248315,475.06044964386592,279.7474505873106,475.24138328467416,279.87440443230844,475.17078942789885,279.35591478107926,475.45932162683312,280.2596911966275,474.95664604573767,279.43619885351018,475.41445699728183,279.60792825709814,475.31880522454594,280.2268960446404,474.97462383905849,280.63754635043097,474.74623881435309,279.88138826498562,475.1669238319505,279.57055944498643,475.33992253250108,279.65342289197815,475.29360536281183,279.56849587547185,475.3408563748053]
["Australia","Couple",175000,4163.014545594523,"I",{"$f":"A10&\"_\"&LEFT(B10, 6)&\"_\"&H10&\"_\"&E10","v":"Australia_Couple_0_I"},{"$f":"MIN(IF(ISNUMBER(FIND({1,2,3,4,5,6,7,8,9,0},B10)),FIND({1,2,3,4,5,6,7,8,9,0},B10)))","v":0},0,null,175000,"I",8,null,"Applicant 2",null,null,null,7,"H",264.82038797438508,479.9816425679619,279.12667419922309,475.58674804096654,278.80151149846279,475.76752138983011,278.92814579750939,475.6969275330548,278.40949612186887,475.98553994786744,279.31311201013887,475.48294444283783,278.49025976466237,475.94059510243778,278.66166962229727,475.84494332970235,279.28063740984089,475.50076194421626,279.69120757770816,475.27265760517776,278.93504949226281,475.69314215298618,278.62430081018647,475.86606063765748,278.70708437069061,475.81990375991336,278.62207721626055,475.86699461977287]
{"$rows_left_out":1671}